Unique Chain 1.14 #2704
Triggered via pull request
January 25, 2025 14:46
Status
Success
Total duration
15h 23m 1s
Artifacts
3
ci-develop.yml
on: pull_request
collator-selection
/
Prepare execution matrix
governance
/
Prepare execution matrix
main-process
/
execution matrix
20s
try-runtime
/
Prepare execution matrix
xcm
/
Prepare execution matrix
xnft
/
Prepare execution matrix
unit-test
/
develop
9m 46s
codestyle
/
rustfmt
16s
codestyle
/
yarn_eslint
23s
codestyle
/
clippy
2m 10s
Matrix: polkadot-types / polkadot_generate_types
Waiting for pending jobs
Matrix: yarn-dev / dev_build_int_tests
Matrix: collator-selection / collator-selection
Waiting for pending jobs
Matrix: governance / dev_build_int_tests
Waiting for pending jobs
Matrix: main-process / main-process
Matrix: try-runtime / try-runtime
Waiting for pending jobs
Matrix: xcm / xcm
Waiting for pending jobs
Matrix: xnft / xnft
Waiting for pending jobs
Annotations
44 errors and 13 warnings
[NFT] Sync sub & eth events ► [NFT] Sync sub & eth events ► CollectionChanged event for TokenPropertySet, TokenPropertyDeleted:
js-packages/tests/mochawesome-report/test-1737817450.json#L0
Failed test found in:
js-packages/tests/mochawesome-report/test-1737817450.json
Error:
AssertionError: expected undefined to be like { event: 'TokenChanged', returnValues: { tokenId: '1' } }
|
[RFT] Sync sub & eth events ► [RFT] Sync sub & eth events ► CollectionChanged event for TokenPropertySet, TokenPropertyDeleted:
js-packages/tests/mochawesome-report/test-1737817450.json#L0
Failed test found in:
js-packages/tests/mochawesome-report/test-1737817450.json
Error:
AssertionError: expected undefined to be like { event: 'TokenChanged', returnValues: { tokenId: '1' } }
|
App promotion ► App promotion contract sponsoring ► can be overwritten by contract owner:
js-packages/tests/mochawesome-report/test-1737817450.json#L0
Failed test found in:
js-packages/tests/mochawesome-report/test-1737817450.json
Error:
Error: Transaction was not mined within 50 blocks, please make sure your transaction was properly sent. Be aware that it might still be mined!
|
App promotion ► App promotion contract sponsoring ► can not be set by non admin:
js-packages/tests/mochawesome-report/test-1737817450.json#L0
Failed test found in:
js-packages/tests/mochawesome-report/test-1737817450.json
Error:
Error: Transaction was not mined within 50 blocks, please make sure your transaction was properly sent. Be aware that it might still be mined!
|
App promotion ► App promotion contract sponsoring ► should actually sponsor transactions:
js-packages/tests/mochawesome-report/test-1737817450.json#L0
Failed test found in:
js-packages/tests/mochawesome-report/test-1737817450.json
Error:
Error: Transaction was not mined within 50 blocks, please make sure your transaction was properly sent. Be aware that it might still be mined!
|
App promotion ► App promotion contract sponsoring ► should overwrite sponsoring mode and existed sponsor:
js-packages/tests/mochawesome-report/test-1737817450.json#L0
Failed test found in:
js-packages/tests/mochawesome-report/test-1737817450.json
Error:
Error: Transaction was not mined within 50 blocks, please make sure your transaction was properly sent. Be aware that it might still be mined!
|
App promotion ► App promotion contract sponsoring ► should set palletes address as a sponsor:
js-packages/tests/mochawesome-report/test-1737817450.json#L0
Failed test found in:
js-packages/tests/mochawesome-report/test-1737817450.json
Error:
Error: Transaction was not mined within 50 blocks, please make sure your transaction was properly sent. Be aware that it might still be mined!
|
App promotion ► App promotion stopSponsoringContract ► can not be called by non-admin:
js-packages/tests/mochawesome-report/test-1737817450.json#L0
Failed test found in:
js-packages/tests/mochawesome-report/test-1737817450.json
Error:
Error: Transaction was not mined within 50 blocks, please make sure your transaction was properly sent. Be aware that it might still be mined!
|
App promotion ► App promotion stopSponsoringContract ► should not affect a contract which is not sponsored by pallete:
js-packages/tests/mochawesome-report/test-1737817450.json#L0
Failed test found in:
js-packages/tests/mochawesome-report/test-1737817450.json
Error:
Error: Transaction was not mined within 50 blocks, please make sure your transaction was properly sent. Be aware that it might still be mined!
|
App promotion ► App promotion stopSponsoringContract ► should remove pallet address from contract sponsors:
js-packages/tests/mochawesome-report/test-1737817450.json#L0
Failed test found in:
js-packages/tests/mochawesome-report/test-1737817450.json
Error:
Error: Transaction was not mined within 50 blocks, please make sure your transaction was properly sent. Be aware that it might still be mined!
|
Contract calls ► Contract calls ► Call of simple contract fee is less than 0.2 UNQ:
js-packages/tests/mochawesome-report/test-1737817450.json#L0
Failed test found in:
js-packages/tests/mochawesome-report/test-1737817450.json
Error:
Error: Transaction was not mined within 50 blocks, please make sure your transaction was properly sent. Be aware that it might still be mined!
|
yarn-dev / opal
Process completed with exit code 1.
|
[NFT] Sync sub & eth events ► [NFT] Sync sub & eth events ► CollectionChanged event for TokenPropertySet, TokenPropertyDeleted:
js-packages/tests/mochawesome-report/test-1737817703.json#L0
Failed test found in:
js-packages/tests/mochawesome-report/test-1737817703.json
Error:
AssertionError: expected undefined to be like { event: 'TokenChanged', returnValues: { tokenId: '1' } }
|
[RFT] Sync sub & eth events ► [RFT] Sync sub & eth events ► CollectionChanged event for TokenPropertySet, TokenPropertyDeleted:
js-packages/tests/mochawesome-report/test-1737817703.json#L0
Failed test found in:
js-packages/tests/mochawesome-report/test-1737817703.json
Error:
AssertionError: expected undefined to be like { event: 'TokenChanged', returnValues: { tokenId: '1' } }
|
App promotion ► App promotion contract sponsoring ► can be overwritten by contract owner:
js-packages/tests/mochawesome-report/test-1737817703.json#L0
Failed test found in:
js-packages/tests/mochawesome-report/test-1737817703.json
Error:
Error: Transaction was not mined within 50 blocks, please make sure your transaction was properly sent. Be aware that it might still be mined!
|
App promotion ► App promotion contract sponsoring ► can not be set by non admin:
js-packages/tests/mochawesome-report/test-1737817703.json#L0
Failed test found in:
js-packages/tests/mochawesome-report/test-1737817703.json
Error:
Error: Transaction was not mined within 50 blocks, please make sure your transaction was properly sent. Be aware that it might still be mined!
|
App promotion ► App promotion contract sponsoring ► should actually sponsor transactions:
js-packages/tests/mochawesome-report/test-1737817703.json#L0
Failed test found in:
js-packages/tests/mochawesome-report/test-1737817703.json
Error:
Error: Transaction was not mined within 50 blocks, please make sure your transaction was properly sent. Be aware that it might still be mined!
|
App promotion ► App promotion contract sponsoring ► should overwrite sponsoring mode and existed sponsor:
js-packages/tests/mochawesome-report/test-1737817703.json#L0
Failed test found in:
js-packages/tests/mochawesome-report/test-1737817703.json
Error:
Error: Transaction was not mined within 50 blocks, please make sure your transaction was properly sent. Be aware that it might still be mined!
|
App promotion ► App promotion contract sponsoring ► should set palletes address as a sponsor:
js-packages/tests/mochawesome-report/test-1737817703.json#L0
Failed test found in:
js-packages/tests/mochawesome-report/test-1737817703.json
Error:
Error: Transaction was not mined within 50 blocks, please make sure your transaction was properly sent. Be aware that it might still be mined!
|
App promotion ► App promotion stopSponsoringContract ► can not be called by non-admin:
js-packages/tests/mochawesome-report/test-1737817703.json#L0
Failed test found in:
js-packages/tests/mochawesome-report/test-1737817703.json
Error:
Error: Transaction was not mined within 50 blocks, please make sure your transaction was properly sent. Be aware that it might still be mined!
|
App promotion ► App promotion stopSponsoringContract ► should not affect a contract which is not sponsored by pallete:
js-packages/tests/mochawesome-report/test-1737817703.json#L0
Failed test found in:
js-packages/tests/mochawesome-report/test-1737817703.json
Error:
Error: Transaction was not mined within 50 blocks, please make sure your transaction was properly sent. Be aware that it might still be mined!
|
App promotion ► App promotion stopSponsoringContract ► should remove pallet address from contract sponsors:
js-packages/tests/mochawesome-report/test-1737817703.json#L0
Failed test found in:
js-packages/tests/mochawesome-report/test-1737817703.json
Error:
Error: Transaction was not mined within 50 blocks, please make sure your transaction was properly sent. Be aware that it might still be mined!
|
Contract calls ► Contract calls ► Call of simple contract fee is less than 0.2 UNQ:
js-packages/tests/mochawesome-report/test-1737817703.json#L0
Failed test found in:
js-packages/tests/mochawesome-report/test-1737817703.json
Error:
Error: Transaction was not mined within 50 blocks, please make sure your transaction was properly sent. Be aware that it might still be mined!
|
yarn-dev / unique
Process completed with exit code 1.
|
[NFT] Sync sub & eth events ► [NFT] Sync sub & eth events ► CollectionChanged event for TokenPropertySet, TokenPropertyDeleted:
js-packages/tests/mochawesome-report/test-1737817712.json#L0
Failed test found in:
js-packages/tests/mochawesome-report/test-1737817712.json
Error:
AssertionError: expected undefined to be like { event: 'TokenChanged', returnValues: { tokenId: '1' } }
|
[RFT] Sync sub & eth events ► [RFT] Sync sub & eth events ► CollectionChanged event for TokenPropertySet, TokenPropertyDeleted:
js-packages/tests/mochawesome-report/test-1737817712.json#L0
Failed test found in:
js-packages/tests/mochawesome-report/test-1737817712.json
Error:
AssertionError: expected undefined to be like { event: 'TokenChanged', returnValues: { tokenId: '1' } }
|
App promotion ► App promotion contract sponsoring ► can be overwritten by contract owner:
js-packages/tests/mochawesome-report/test-1737817712.json#L0
Failed test found in:
js-packages/tests/mochawesome-report/test-1737817712.json
Error:
Error: Transaction was not mined within 50 blocks, please make sure your transaction was properly sent. Be aware that it might still be mined!
|
App promotion ► App promotion contract sponsoring ► can not be set by non admin:
js-packages/tests/mochawesome-report/test-1737817712.json#L0
Failed test found in:
js-packages/tests/mochawesome-report/test-1737817712.json
Error:
Error: Transaction was not mined within 50 blocks, please make sure your transaction was properly sent. Be aware that it might still be mined!
|
App promotion ► App promotion contract sponsoring ► should actually sponsor transactions:
js-packages/tests/mochawesome-report/test-1737817712.json#L0
Failed test found in:
js-packages/tests/mochawesome-report/test-1737817712.json
Error:
Error: Transaction was not mined within 50 blocks, please make sure your transaction was properly sent. Be aware that it might still be mined!
|
App promotion ► App promotion contract sponsoring ► should overwrite sponsoring mode and existed sponsor:
js-packages/tests/mochawesome-report/test-1737817712.json#L0
Failed test found in:
js-packages/tests/mochawesome-report/test-1737817712.json
Error:
Error: Transaction was not mined within 50 blocks, please make sure your transaction was properly sent. Be aware that it might still be mined!
|
App promotion ► App promotion contract sponsoring ► should set palletes address as a sponsor:
js-packages/tests/mochawesome-report/test-1737817712.json#L0
Failed test found in:
js-packages/tests/mochawesome-report/test-1737817712.json
Error:
Error: Transaction was not mined within 50 blocks, please make sure your transaction was properly sent. Be aware that it might still be mined!
|
App promotion ► App promotion stopSponsoringContract ► can not be called by non-admin:
js-packages/tests/mochawesome-report/test-1737817712.json#L0
Failed test found in:
js-packages/tests/mochawesome-report/test-1737817712.json
Error:
Error: Transaction was not mined within 50 blocks, please make sure your transaction was properly sent. Be aware that it might still be mined!
|
App promotion ► App promotion stopSponsoringContract ► should not affect a contract which is not sponsored by pallete:
js-packages/tests/mochawesome-report/test-1737817712.json#L0
Failed test found in:
js-packages/tests/mochawesome-report/test-1737817712.json
Error:
Error: Transaction was not mined within 50 blocks, please make sure your transaction was properly sent. Be aware that it might still be mined!
|
App promotion ► App promotion stopSponsoringContract ► should remove pallet address from contract sponsors:
js-packages/tests/mochawesome-report/test-1737817712.json#L0
Failed test found in:
js-packages/tests/mochawesome-report/test-1737817712.json
Error:
Error: Transaction was not mined within 50 blocks, please make sure your transaction was properly sent. Be aware that it might still be mined!
|
Contract calls ► Contract calls ► Call of simple contract fee is less than 0.2 UNQ:
js-packages/tests/mochawesome-report/test-1737817712.json#L0
Failed test found in:
js-packages/tests/mochawesome-report/test-1737817712.json
Error:
Error: Transaction was not mined within 50 blocks, please make sure your transaction was properly sent. Be aware that it might still be mined!
|
yarn-dev / quartz
Process completed with exit code 1.
|
main-process / opal-update
No test report files were found
|
main-process / opal-update
Process completed with exit code 1.
|
Integration Test: Maintenance Functionality ► Integration Test: Maintenance Functionality Maintenance Mode ► MM blocks unique pallet calls:
js-packages/tests/mochawesome-report/test-sequential-1737842835.json#L0
Failed test found in:
js-packages/tests/mochawesome-report/test-sequential-1737842835.json
Error:
AssertionError: cudo forbidden stuff: expected promise to be rejected with an error matching /Invalid Transaction: Transaction call is not expected/ but got '1002: Verification Error: Runtime error: Api called for an unknown Block: State already discarded for 0x3e46e9a089c9eea2b8e022e3c3d34db1525ff44aa5c2a19993b20aa77e38ac06: RuntimeApi, Api called for an unknown Block: State already discarded for 0x3e46e9a089c9eea2b8e022e3c3d34db1525ff44aa5c2a19993b20aa77e38ac06'
|
main-process / unique-update
Process completed with exit code 1.
|
main-process / unique-update
No test report files were found
|
main-process / unique-update
Process completed with exit code 1.
|
main-process / quartz-update
Process completed with exit code 1.
|
main-process / quartz-update
No test report files were found
|
codestyle / yarn_eslint:
js-packages/playgrounds/unique.ts#L196
toHuman results in horrible, hard to debug conversions with no stability guarantees, use Codec/at least .toJson instead
|
codestyle / yarn_eslint:
js-packages/playgrounds/unique.ts#L230
toHuman results in horrible, hard to debug conversions with no stability guarantees, use Codec/at least .toJson instead
|
codestyle / yarn_eslint:
js-packages/playgrounds/unique.ts#L254
toHuman results in horrible, hard to debug conversions with no stability guarantees, use Codec/at least .toJson instead
|
codestyle / yarn_eslint:
js-packages/playgrounds/unique.ts#L289
toHuman results in horrible, hard to debug conversions with no stability guarantees, use Codec/at least .toJson instead
|
codestyle / yarn_eslint:
js-packages/playgrounds/unique.ts#L290
toHuman results in horrible, hard to debug conversions with no stability guarantees, use Codec/at least .toJson instead
|
codestyle / yarn_eslint:
js-packages/playgrounds/unique.ts#L337
toHuman results in horrible, hard to debug conversions with no stability guarantees, use Codec/at least .toJson instead
|
codestyle / yarn_eslint:
js-packages/playgrounds/unique.ts#L337
toHuman results in horrible, hard to debug conversions with no stability guarantees, use Codec/at least .toJson instead
|
codestyle / yarn_eslint:
js-packages/playgrounds/unique.ts#L341
toHuman results in horrible, hard to debug conversions with no stability guarantees, use Codec/at least .toJson instead
|
codestyle / yarn_eslint:
js-packages/playgrounds/unique.ts#L345
toHuman results in horrible, hard to debug conversions with no stability guarantees, use Codec/at least .toJson instead
|
codestyle / yarn_eslint:
js-packages/playgrounds/unique.ts#L399
Variable name `InvalidTypeSymbol` must match one of the following formats: camelCase, UPPER_CASE
|
main-process / opal-update
No file matches path js-packages/tests/mochawesome-report/test-parallel-*.json
|
main-process / unique-update
No file matches path js-packages/tests/mochawesome-report/test-parallel-*.json
|
main-process / quartz-update
No file matches path js-packages/tests/mochawesome-report/test-parallel-*.json
|
Artifacts
Produced during runtime
Name | Size | |
---|---|---|
opal-main-baedeker-logs
Expired
|
5.01 MB |
|
quartz-main-baedeker-logs
Expired
|
6.22 MB |
|
unique-main-baedeker-logs
Expired
|
6.19 MB |
|