Unique Chain 1.14 #2708
Triggered via pull request
February 19, 2025 23:31
Status
Success
Total duration
13h 59m 18s
Artifacts
3
ci-develop.yml
on: pull_request
collator-selection
/
Prepare execution matrix
governance
/
Prepare execution matrix
main-process
/
execution matrix
27s
try-runtime
/
Prepare execution matrix
xcm
/
Prepare execution matrix
xnft
/
Prepare execution matrix
unit-test
/
develop
8m 34s
codestyle
/
rustfmt
17s
codestyle
/
yarn_eslint
24s
codestyle
/
clippy
2m 22s
Matrix: polkadot-types / polkadot_generate_types
Waiting for pending jobs
Matrix: yarn-dev / dev_build_int_tests
Matrix: collator-selection / collator-selection
Waiting for pending jobs
Matrix: governance / dev_build_int_tests
Waiting for pending jobs
Matrix: main-process / main-process
Matrix: try-runtime / try-runtime
Waiting for pending jobs
Matrix: xcm / xcm
Waiting for pending jobs
Matrix: xnft / xnft
Waiting for pending jobs
Annotations
42 errors and 13 warnings
[NFT] Sync sub & eth events ► [NFT] Sync sub & eth events ► CollectionChanged event for TokenPropertySet, TokenPropertyDeleted:
js-packages/tests/mochawesome-report/test-1740008719.json#L0
Failed test found in:
js-packages/tests/mochawesome-report/test-1740008719.json
Error:
AssertionError: expected undefined to be like { event: 'TokenChanged', returnValues: { tokenId: '1' } }
|
[RFT] Sync sub & eth events ► [RFT] Sync sub & eth events ► CollectionChanged event for TokenPropertySet, TokenPropertyDeleted:
js-packages/tests/mochawesome-report/test-1740008719.json#L0
Failed test found in:
js-packages/tests/mochawesome-report/test-1740008719.json
Error:
AssertionError: expected undefined to be like { event: 'TokenChanged', returnValues: { tokenId: '1' } }
|
Fractionalizer contract usage ► Fractionalizer contract usage ► Mint RFT collection:
js-packages/tests/mochawesome-report/test-1740008719.json#L0
Failed test found in:
js-packages/tests/mochawesome-report/test-1740008719.json
Error:
AssertionError: expected <Anonymous Class>{ events: undefined, normalizedEvents: undefined } to be like { RFTCollectionSet: {} }
|
Fractionalizer contract usage ► Fractionalizer contract usage ► NFT to RFT:
js-packages/tests/mochawesome-report/test-1740008719.json#L0
Failed test found in:
js-packages/tests/mochawesome-report/test-1740008719.json
Error:
AssertionError: expected <Anonymous Class>{ events: undefined, normalizedEvents: undefined } to be like { Fractionalized: { returnValues: { _collection: '0x17c4e6453CC49aaAAEaCa894e6D9683e000001c1', _tokenId: '1', _amount: '100' } } }
|
Fractionalizer contract usage ► Fractionalizer contract usage ► RFT to NFT:
js-packages/tests/mochawesome-report/test-1740008719.json#L0
Failed test found in:
js-packages/tests/mochawesome-report/test-1740008719.json
Error:
AssertionError: expected <Anonymous Class>{ events: undefined, normalizedEvents: undefined } to be like { Defractionalized: { returnValues: { _rftToken: '0xf8238Ccfff8eD887463fD5E0000001C300000001', _nftCollection: '0x17C4E6453cc49aaaAEAcA894E6D9683e000001c4', _nftTokenId: '1' } } }
|
Fractionalizer contract usage ► Fractionalizer contract usage ► Set Allowlist:
js-packages/tests/mochawesome-report/test-1740008719.json#L0
Failed test found in:
js-packages/tests/mochawesome-report/test-1740008719.json
Error:
AssertionError: expected <Anonymous Class>{ events: undefined, normalizedEvents: undefined } to be like { AllowListSet: { returnValues: { _collection: '0x17c4e6453cc49aAAAeACa894E6d9683e000001c0', _status: true } } }
|
Fractionalizer contract usage ► Fractionalizer contract usage ► Set RFT collection:
js-packages/tests/mochawesome-report/test-1740008719.json#L0
Failed test found in:
js-packages/tests/mochawesome-report/test-1740008719.json
Error:
AssertionError: expected <Anonymous Class>{ events: undefined, normalizedEvents: undefined } to be like { RFTCollectionSet: { returnValues: { _collection: '0x17C4e6453CC49aaAAeaCA894E6d9683e000001BD' } } }
|
Fungible: Plain calls ► Fungible: Plain calls ► Can perform burnFromCross():
js-packages/tests/mochawesome-report/test-1740008719.json#L0
Failed test found in:
js-packages/tests/mochawesome-report/test-1740008719.json
Error:
AssertionError: expected <Anonymous Class>{ events: undefined, normalizedEvents: undefined } to be like { Transfer: { address: '0x17c4E6453cc49aaaAEACa894E6d9683E000001E3', event: 'Transfer', returnValues: { from: '0x0089F9f3a03c53D498F685B3F9c648b4164b23c9', to: '0x0000000000000000000000000000000000000000', value: '49' } }, Approval: { address: '0x17c4E6453cc49aaaAEACa894E6d9683E000001E3', returnValues: { owner: '0x0089F9f3a03c53D498F685B3F9c648b4164b23c9', spender: '0x534990fD53b24c855487569cFB9f1FDf2DD3EFf8', value: '51' }, event: 'Approval' } }
|
Fungible: Plain calls ► Fungible: Plain calls ► Can perform mintBulk():
js-packages/tests/mochawesome-report/test-1740008719.json#L0
Failed test found in:
js-packages/tests/mochawesome-report/test-1740008719.json
Error:
TypeError: result.events.filter is not a function
|
Fungible: Plain calls ► Fungible: Plain calls ► Can perform transferFromCross():
js-packages/tests/mochawesome-report/test-1740008719.json#L0
Failed test found in:
js-packages/tests/mochawesome-report/test-1740008719.json
Error:
AssertionError: expected <Anonymous Class>{ events: undefined, normalizedEvents: undefined } to be like { Transfer: { address: '0x17C4E6453CC49aaAAEAcA894e6d9683e000001e9', event: 'Transfer', returnValues: { from: '0x0089F9f3a03c53D498F685B3F9c648b4164b23c9', to: '0x926d00E9902A80C04869De40fFB04D78fCbc16a0', value: '51' } }, Approval: { address: '0x17C4E6453CC49aaAAEAcA894e6d9683e000001e9', event: 'Approval', returnValues: { owner: '0x0089F9f3a03c53D498F685B3F9c648b4164b23c9', spender: '0x65DC13cD82711b284aF2cafb19634286B2B03a61', value: '49' } } }
|
Fungible: Substrate calls ► Fungible: Substrate calls ► Events emitted for transferFromCross():
js-packages/tests/mochawesome-report/test-1740008719.json#L0
Failed test found in:
js-packages/tests/mochawesome-report/test-1740008719.json
Error:
AssertionError: expected <Anonymous Class>{ events: undefined, normalizedEvents: undefined } to be like { Transfer: { address: '0x17C4E6453cc49AaaAeACa894e6D9683E000001f1', event: 'Transfer', returnValues: { from: '0x40a65efcDA0722fe3da0Fb298A0bee48A3713e22', to: '0xC42554e89Be4d2BBcAA8E4741BBE1B3F4C25931C', value: '51' } }, Approval: { address: '0x17C4E6453cc49AaaAeACa894e6D9683E000001f1', event: 'Approval', returnValues: { owner: '0x40a65efcDA0722fe3da0Fb298A0bee48A3713e22', spender: '0x97176eC1C0de57a7053F01F57eF9C8D3eBb6f5A9', value: '49' } } }
|
yarn-dev / quartz
Process completed with exit code 1.
|
[NFT] Sync sub & eth events ► [NFT] Sync sub & eth events ► CollectionChanged event for TokenPropertySet, TokenPropertyDeleted:
js-packages/tests/mochawesome-report/test-1740009133.json#L0
Failed test found in:
js-packages/tests/mochawesome-report/test-1740009133.json
Error:
AssertionError: expected undefined to be like { event: 'TokenChanged', returnValues: { tokenId: '1' } }
|
[RFT] Sync sub & eth events ► [RFT] Sync sub & eth events ► CollectionChanged event for TokenPropertySet, TokenPropertyDeleted:
js-packages/tests/mochawesome-report/test-1740009133.json#L0
Failed test found in:
js-packages/tests/mochawesome-report/test-1740009133.json
Error:
AssertionError: expected undefined to be like { event: 'TokenChanged', returnValues: { tokenId: '1' } }
|
Fractionalizer contract usage ► Fractionalizer contract usage ► Mint RFT collection:
js-packages/tests/mochawesome-report/test-1740009133.json#L0
Failed test found in:
js-packages/tests/mochawesome-report/test-1740009133.json
Error:
AssertionError: expected <Anonymous Class>{ events: undefined, normalizedEvents: undefined } to be like { RFTCollectionSet: {} }
|
Fractionalizer contract usage ► Fractionalizer contract usage ► NFT to RFT:
js-packages/tests/mochawesome-report/test-1740009133.json#L0
Failed test found in:
js-packages/tests/mochawesome-report/test-1740009133.json
Error:
AssertionError: expected <Anonymous Class>{ events: undefined, normalizedEvents: undefined } to be like { Fractionalized: { returnValues: { _collection: '0x17c4e6453CC49aaAAEaCa894e6D9683e000001c1', _tokenId: '1', _amount: '100' } } }
|
Fractionalizer contract usage ► Fractionalizer contract usage ► RFT to NFT:
js-packages/tests/mochawesome-report/test-1740009133.json#L0
Failed test found in:
js-packages/tests/mochawesome-report/test-1740009133.json
Error:
AssertionError: expected <Anonymous Class>{ events: undefined, normalizedEvents: undefined } to be like { Defractionalized: { returnValues: { _rftToken: '0xf8238Ccfff8eD887463fD5E0000001C300000001', _nftCollection: '0x17C4E6453cc49aaaAEAcA894E6D9683e000001c4', _nftTokenId: '1' } } }
|
Fractionalizer contract usage ► Fractionalizer contract usage ► Set Allowlist:
js-packages/tests/mochawesome-report/test-1740009133.json#L0
Failed test found in:
js-packages/tests/mochawesome-report/test-1740009133.json
Error:
AssertionError: expected <Anonymous Class>{ events: undefined, normalizedEvents: undefined } to be like { AllowListSet: { returnValues: { _collection: '0x17c4e6453cc49aAAAeACa894E6d9683e000001c0', _status: true } } }
|
Fractionalizer contract usage ► Fractionalizer contract usage ► Set RFT collection:
js-packages/tests/mochawesome-report/test-1740009133.json#L0
Failed test found in:
js-packages/tests/mochawesome-report/test-1740009133.json
Error:
AssertionError: expected <Anonymous Class>{ events: undefined, normalizedEvents: undefined } to be like { RFTCollectionSet: { returnValues: { _collection: '0x17C4e6453CC49aaAAeaCA894E6d9683e000001BD' } } }
|
Fungible: Plain calls ► Fungible: Plain calls ► Can perform burnFromCross():
js-packages/tests/mochawesome-report/test-1740009133.json#L0
Failed test found in:
js-packages/tests/mochawesome-report/test-1740009133.json
Error:
AssertionError: expected <Anonymous Class>{ events: undefined, normalizedEvents: undefined } to be like { Transfer: { address: '0x17c4E6453cc49aaaAEACa894E6d9683E000001E3', event: 'Transfer', returnValues: { from: '0xa017D2d240749c60690dDe38a9749e4360BBE53d', to: '0x0000000000000000000000000000000000000000', value: '49' } }, Approval: { address: '0x17c4E6453cc49aaaAEACa894E6d9683E000001E3', returnValues: { owner: '0xa017D2d240749c60690dDe38a9749e4360BBE53d', spender: '0x2E5802DC518aA34F194425196162B8B08f5A355F', value: '51' }, event: 'Approval' } }
|
Fungible: Plain calls ► Fungible: Plain calls ► Can perform mintBulk():
js-packages/tests/mochawesome-report/test-1740009133.json#L0
Failed test found in:
js-packages/tests/mochawesome-report/test-1740009133.json
Error:
TypeError: result.events.filter is not a function
|
Fungible: Plain calls ► Fungible: Plain calls ► Can perform transferFromCross():
js-packages/tests/mochawesome-report/test-1740009133.json#L0
Failed test found in:
js-packages/tests/mochawesome-report/test-1740009133.json
Error:
AssertionError: expected <Anonymous Class>{ events: undefined, normalizedEvents: undefined } to be like { Transfer: { address: '0x17C4E6453CC49aaAAEAcA894e6d9683e000001e9', event: 'Transfer', returnValues: { from: '0xa017D2d240749c60690dDe38a9749e4360BBE53d', to: '0xf3B6501cd092BFc61997Dd61c2741c25Ee59449e', value: '51' } }, Approval: { address: '0x17C4E6453CC49aaAAEAcA894e6d9683e000001e9', event: 'Approval', returnValues: { owner: '0xa017D2d240749c60690dDe38a9749e4360BBE53d', spender: '0x665457f077F9aE99E363222409c8471eF8E8E774', value: '49' } } }
|
Fungible: Substrate calls ► Fungible: Substrate calls ► Events emitted for transferFromCross():
js-packages/tests/mochawesome-report/test-1740009133.json#L0
Failed test found in:
js-packages/tests/mochawesome-report/test-1740009133.json
Error:
AssertionError: expected <Anonymous Class>{ events: undefined, normalizedEvents: undefined } to be like { Transfer: { address: '0x17C4E6453cc49AaaAeACa894e6D9683E000001f1', event: 'Transfer', returnValues: { from: '0xf84B2E872a094503C80A2c7f4E1Ebe96FA92Ff6a', to: '0x2135FAADd46eAD235726cC1C1DC9F3183C703D00', value: '51' } }, Approval: { address: '0x17C4E6453cc49AaaAeACa894e6D9683E000001f1', event: 'Approval', returnValues: { owner: '0xf84B2E872a094503C80A2c7f4E1Ebe96FA92Ff6a', spender: '0xa88ff99E2ee5A66204E74BA99d239a9f220cEDC6', value: '49' } } }
|
yarn-dev / opal
Process completed with exit code 1.
|
[NFT] Sync sub & eth events ► [NFT] Sync sub & eth events ► CollectionChanged event for TokenPropertySet, TokenPropertyDeleted:
js-packages/tests/mochawesome-report/test-1740009175.json#L0
Failed test found in:
js-packages/tests/mochawesome-report/test-1740009175.json
Error:
AssertionError: expected undefined to be like { event: 'TokenChanged', returnValues: { tokenId: '1' } }
|
[RFT] Sync sub & eth events ► [RFT] Sync sub & eth events ► CollectionChanged event for TokenPropertySet, TokenPropertyDeleted:
js-packages/tests/mochawesome-report/test-1740009175.json#L0
Failed test found in:
js-packages/tests/mochawesome-report/test-1740009175.json
Error:
AssertionError: expected undefined to be like { event: 'TokenChanged', returnValues: { tokenId: '1' } }
|
Fractionalizer contract usage ► Fractionalizer contract usage ► Mint RFT collection:
js-packages/tests/mochawesome-report/test-1740009175.json#L0
Failed test found in:
js-packages/tests/mochawesome-report/test-1740009175.json
Error:
AssertionError: expected <Anonymous Class>{ events: undefined, normalizedEvents: undefined } to be like { RFTCollectionSet: {} }
|
Fractionalizer contract usage ► Fractionalizer contract usage ► NFT to RFT:
js-packages/tests/mochawesome-report/test-1740009175.json#L0
Failed test found in:
js-packages/tests/mochawesome-report/test-1740009175.json
Error:
AssertionError: expected <Anonymous Class>{ events: undefined, normalizedEvents: undefined } to be like { Fractionalized: { returnValues: { _collection: '0x17c4e6453CC49aaAAEaCa894e6D9683e000001c1', _tokenId: '1', _amount: '100' } } }
|
Fractionalizer contract usage ► Fractionalizer contract usage ► RFT to NFT:
js-packages/tests/mochawesome-report/test-1740009175.json#L0
Failed test found in:
js-packages/tests/mochawesome-report/test-1740009175.json
Error:
AssertionError: expected <Anonymous Class>{ events: undefined, normalizedEvents: undefined } to be like { Defractionalized: { returnValues: { _rftToken: '0xf8238Ccfff8eD887463fD5E0000001C300000001', _nftCollection: '0x17C4E6453cc49aaaAEAcA894E6D9683e000001c4', _nftTokenId: '1' } } }
|
Fractionalizer contract usage ► Fractionalizer contract usage ► Set Allowlist:
js-packages/tests/mochawesome-report/test-1740009175.json#L0
Failed test found in:
js-packages/tests/mochawesome-report/test-1740009175.json
Error:
AssertionError: expected <Anonymous Class>{ events: undefined, normalizedEvents: undefined } to be like { AllowListSet: { returnValues: { _collection: '0x17c4e6453cc49aAAAeACa894E6d9683e000001c0', _status: true } } }
|
Fractionalizer contract usage ► Fractionalizer contract usage ► Set RFT collection:
js-packages/tests/mochawesome-report/test-1740009175.json#L0
Failed test found in:
js-packages/tests/mochawesome-report/test-1740009175.json
Error:
AssertionError: expected <Anonymous Class>{ events: undefined, normalizedEvents: undefined } to be like { RFTCollectionSet: { returnValues: { _collection: '0x17C4e6453CC49aaAAeaCA894E6d9683e000001BD' } } }
|
Fungible: Plain calls ► Fungible: Plain calls ► Can perform burnFromCross():
js-packages/tests/mochawesome-report/test-1740009175.json#L0
Failed test found in:
js-packages/tests/mochawesome-report/test-1740009175.json
Error:
AssertionError: expected <Anonymous Class>{ events: undefined, normalizedEvents: undefined } to be like { Transfer: { address: '0x17c4E6453cc49aaaAEACa894E6d9683E000001E3', event: 'Transfer', returnValues: { from: '0xD29645fAd33e13c8Af72a93B1C9519F036D2Ba96', to: '0x0000000000000000000000000000000000000000', value: '49' } }, Approval: { address: '0x17c4E6453cc49aaaAEACa894E6d9683E000001E3', returnValues: { owner: '0xD29645fAd33e13c8Af72a93B1C9519F036D2Ba96', spender: '0x75B925f01386db437CedDe602a0D5AA869E17FBB', value: '51' }, event: 'Approval' } }
|
Fungible: Plain calls ► Fungible: Plain calls ► Can perform mintBulk():
js-packages/tests/mochawesome-report/test-1740009175.json#L0
Failed test found in:
js-packages/tests/mochawesome-report/test-1740009175.json
Error:
TypeError: result.events.filter is not a function
|
Fungible: Plain calls ► Fungible: Plain calls ► Can perform transferFromCross():
js-packages/tests/mochawesome-report/test-1740009175.json#L0
Failed test found in:
js-packages/tests/mochawesome-report/test-1740009175.json
Error:
AssertionError: expected <Anonymous Class>{ events: undefined, normalizedEvents: undefined } to be like { Transfer: { address: '0x17C4E6453CC49aaAAEAcA894e6d9683e000001e9', event: 'Transfer', returnValues: { from: '0xD29645fAd33e13c8Af72a93B1C9519F036D2Ba96', to: '0x8DA2356c1F84bC9688E21DA4C76c5218Ad070578', value: '51' } }, Approval: { address: '0x17C4E6453CC49aaAAEAcA894e6d9683e000001e9', event: 'Approval', returnValues: { owner: '0xD29645fAd33e13c8Af72a93B1C9519F036D2Ba96', spender: '0xfb0D3a9F1c58dD5EAfb68d0E86ef83042Be257Ee', value: '49' } } }
|
Fungible: Substrate calls ► Fungible: Substrate calls ► Events emitted for transferFromCross():
js-packages/tests/mochawesome-report/test-1740009175.json#L0
Failed test found in:
js-packages/tests/mochawesome-report/test-1740009175.json
Error:
AssertionError: expected <Anonymous Class>{ events: undefined, normalizedEvents: undefined } to be like { Transfer: { address: '0x17C4E6453cc49AaaAeACa894e6D9683E000001f1', event: 'Transfer', returnValues: { from: '0x528cf06638c132983717858472a5429fc1E6E67e', to: '0xfec7890E5Affe64e3bdf045C0216AE39Fe74763A', value: '51' } }, Approval: { address: '0x17C4E6453cc49AaaAeACa894e6D9683E000001f1', event: 'Approval', returnValues: { owner: '0x528cf06638c132983717858472a5429fc1E6E67e', spender: '0xe3cE961C882f170039ac81a2E212C6a8D540f04d', value: '49' } } }
|
yarn-dev / unique
Process completed with exit code 1.
|
main-process / unique-update
No test report files were found
|
main-process / unique-update
Process completed with exit code 1.
|
main-process / quartz-update
Process completed with exit code 1.
|
main-process / quartz-update
No test report files were found
|
main-process / opal-update
No test report files were found
|
main-process / opal-update
Process completed with exit code 1.
|
codestyle / yarn_eslint:
js-packages/playgrounds/unique.ts#L196
toHuman results in horrible, hard to debug conversions with no stability guarantees, use Codec/at least .toJson instead
|
codestyle / yarn_eslint:
js-packages/playgrounds/unique.ts#L230
toHuman results in horrible, hard to debug conversions with no stability guarantees, use Codec/at least .toJson instead
|
codestyle / yarn_eslint:
js-packages/playgrounds/unique.ts#L254
toHuman results in horrible, hard to debug conversions with no stability guarantees, use Codec/at least .toJson instead
|
codestyle / yarn_eslint:
js-packages/playgrounds/unique.ts#L289
toHuman results in horrible, hard to debug conversions with no stability guarantees, use Codec/at least .toJson instead
|
codestyle / yarn_eslint:
js-packages/playgrounds/unique.ts#L290
toHuman results in horrible, hard to debug conversions with no stability guarantees, use Codec/at least .toJson instead
|
codestyle / yarn_eslint:
js-packages/playgrounds/unique.ts#L337
toHuman results in horrible, hard to debug conversions with no stability guarantees, use Codec/at least .toJson instead
|
codestyle / yarn_eslint:
js-packages/playgrounds/unique.ts#L337
toHuman results in horrible, hard to debug conversions with no stability guarantees, use Codec/at least .toJson instead
|
codestyle / yarn_eslint:
js-packages/playgrounds/unique.ts#L341
toHuman results in horrible, hard to debug conversions with no stability guarantees, use Codec/at least .toJson instead
|
codestyle / yarn_eslint:
js-packages/playgrounds/unique.ts#L345
toHuman results in horrible, hard to debug conversions with no stability guarantees, use Codec/at least .toJson instead
|
codestyle / yarn_eslint:
js-packages/playgrounds/unique.ts#L399
Variable name `InvalidTypeSymbol` must match one of the following formats: camelCase, UPPER_CASE
|
main-process / unique-update
No file matches path js-packages/tests/mochawesome-report/test-parallel-*.json
|
main-process / quartz-update
No file matches path js-packages/tests/mochawesome-report/test-parallel-*.json
|
main-process / opal-update
No file matches path js-packages/tests/mochawesome-report/test-parallel-*.json
|
Artifacts
Produced during runtime
Name | Size | |
---|---|---|
opal-main-baedeker-logs
Expired
|
6 MB |
|
quartz-main-baedeker-logs
Expired
|
6.15 MB |
|
unique-main-baedeker-logs
Expired
|
6.11 MB |
|