feat: add financial council #2359
ci-develop.yml
on: pull_request
try-runtime
/
Prepare execution matrix
canary
/
...
/
Prepare execution matrix
collator-selection
/
Prepare execution matrix
forkless-update-data
/
execution matrix
forkless-update-no-data
/
execution matrix
governance
/
Prepare execution matrix
node-only-update
/
execution matrix
xcm
/
Prepare execution matrix
xnft
/
Prepare execution matrix
unit-test
/
develop
36s
codestyle
/
rustfmt
17s
codestyle
/
yarn_eslint
29s
codestyle
/
clippy
38s
Matrix: polkadot-types / polkadot_generate_types
Waiting for pending jobs
Matrix: yarn-dev / dev_build_int_tests
Matrix: try-runtime / try-runtime-build
Waiting for pending jobs
Matrix: canary / market e2e tests / market_test
Waiting for pending jobs
Matrix: collator-selection / collator-selection
Waiting for pending jobs
Matrix: forkless-update-data / forkless-data
Waiting for pending jobs
Matrix: forkless-update-no-data / forkless-nodata
Waiting for pending jobs
Matrix: governance / dev_build_int_tests
Waiting for pending jobs
Matrix: node-only-update / node-only-update
Waiting for pending jobs
Matrix: xcm / xcm
Waiting for pending jobs
Matrix: xnft / xnft
Waiting for pending jobs
Matrix: try-runtime / try-runtime-tests
Waiting for pending jobs
Annotations
19 errors and 11 warnings
codestyle / rustfmt
Process completed with exit code 1.
|
codestyle / yarn_eslint
Canceling since a higher priority waiting request for 'develop-feature/financial-council' exists
|
codestyle / yarn_eslint
The operation was canceled.
|
unit-test / develop
Canceling since a higher priority waiting request for 'develop-feature/financial-council' exists
|
unit-test / develop
The operation was canceled.
|
yarn-dev / sapphire
Canceling since a higher priority waiting request for 'develop-feature/financial-council' exists
|
yarn-dev / sapphire
The operation was canceled.
|
codestyle / clippy
Canceling since a higher priority waiting request for 'develop-feature/financial-council' exists
|
codestyle / clippy
The operation was canceled.
|
yarn-dev / opal
Canceling since a higher priority waiting request for 'develop-feature/financial-council' exists
|
yarn-dev / opal
The operation was canceled.
|
yarn-dev / unique
Canceling since a higher priority waiting request for 'develop-feature/financial-council' exists
|
yarn-dev / unique
The operation was canceled.
|
yarn-dev / quartz
Canceling since a higher priority waiting request for 'develop-feature/financial-council' exists
|
yarn-dev / quartz
The operation was canceled.
|
► Pallet presence ► No extra pallets are included:
js-packages/tests/mochawesome-report/test-1711461529.json#L0
Failed test found in:
js-packages/tests/mochawesome-report/test-1711461529.json
Error:
AssertionError: expected [ 'apppromotion', 'aura', 'auraext', 'authorship', 'balances', 'balancesadapter', 'charging', 'collatorselection', 'common', 'configuration', 'council', 'councilmembership', 'cumulusxcm', 'democracy', 'dmpqueue', 'ethereum', 'evm', 'evmcodersubstrate', 'evmcontracthelpers', 'evmmigration', 'evmtransactionpayment', 'fellowshipcollective', 'fellowshipreferenda', 'financialcouncil', 'financialcouncilmembership', 'foreignassets', 'fungible', 'identity', 'inflation', 'maintenance', 'nonfungible', 'origins', 'parachaininfo', 'parachainsystem', 'polkadotxcm', 'preimage', 'refungible', 'scheduler', 'session', 'statetriemigration', 'structure', 'sudo', 'system', 'technicalcommittee', 'technicalcommitteemembership', 'testutils', 'timestamp', 'transactionpayment', 'treasury', 'unique', 'utility', 'vesting', 'xcmpqueue', 'xtokens' ] to deeply equal [ 'apppromotion', 'aura', 'auraext', 'authorship', 'balances', 'balancesadapter', 'charging', 'collatorselection', 'common', 'configuration', 'council', 'councilmembership', 'cumulusxcm', 'democracy', 'dmpqueue', 'ethereum', 'evm', 'evmcodersubstrate', 'evmcontracthelpers', 'evmmigration', 'evmtransactionpayment', 'fellowshipcollective', 'fellowshipreferenda', 'foreignassets', 'fungible', 'identity', 'inflation', 'maintenance', 'nonfungible', 'origins', 'parachaininfo', 'parachainsystem', 'polkadotxcm', 'preimage', 'refungible', 'scheduler', 'session', 'statetriemigration', 'structure', 'sudo', 'system', 'technicalcommittee', 'technicalcommitteemembership', 'testutils', 'timestamp', 'transactionpayment', 'treasury', 'unique', 'utility', 'vesting', 'xcmpqueue', 'xtokens' ]
|
► Pallet presence ► No extra pallets are included:
js-packages/tests/mochawesome-report/test-1711461429.json#L0
Failed test found in:
js-packages/tests/mochawesome-report/test-1711461429.json
Error:
AssertionError: expected [ 'apppromotion', 'aura', 'auraext', 'balances', 'balancesadapter', 'charging', 'common', 'configuration', 'council', 'councilmembership', 'cumulusxcm', 'democracy', 'dmpqueue', 'ethereum', 'evm', 'evmcodersubstrate', 'evmcontracthelpers', 'evmmigration', 'evmtransactionpayment', 'fellowshipcollective', 'fellowshipreferenda', 'financialcouncil', 'financialcouncilmembership', 'foreignassets', 'fungible', 'identity', 'inflation', 'maintenance', 'nonfungible', 'origins', 'parachaininfo', 'parachainsystem', 'polkadotxcm', 'preimage', 'refungible', 'scheduler', 'statetriemigration', 'structure', 'sudo', 'system', 'technicalcommittee', 'technicalcommitteemembership', 'timestamp', 'transactionpayment', 'treasury', 'unique', 'utility', 'vesting', 'xcmpqueue', 'xtokens' ] to deeply equal [ 'apppromotion', 'aura', 'auraext', 'balances', 'balancesadapter', 'charging', 'common', 'configuration', 'council', 'councilmembership', 'cumulusxcm', 'democracy', 'dmpqueue', 'ethereum', 'evm', 'evmcodersubstrate', 'evmcontracthelpers', 'evmmigration', 'evmtransactionpayment', 'fellowshipcollective', 'fellowshipreferenda', 'foreignassets', 'fungible', 'identity', 'inflation', 'maintenance', 'nonfungible', 'origins', 'parachaininfo', 'parachainsystem', 'polkadotxcm', 'preimage', 'refungible', 'scheduler', 'statetriemigration', 'structure', 'sudo', 'system', 'technicalcommittee', 'technicalcommitteemembership', 'timestamp', 'transactionpayment', 'treasury', 'unique', 'utility', 'vesting', 'xcmpqueue', 'xtokens' ]
|
► Pallet presence ► No extra pallets are included:
js-packages/tests/mochawesome-report/test-1711461821.json#L0
Failed test found in:
js-packages/tests/mochawesome-report/test-1711461821.json
Error:
AssertionError: expected [ 'apppromotion', 'aura', 'auraext', 'authorship', 'balances', 'balancesadapter', 'charging', 'collatorselection', 'common', 'configuration', 'council', 'councilmembership', 'cumulusxcm', 'democracy', 'dmpqueue', 'ethereum', 'evm', 'evmcodersubstrate', 'evmcontracthelpers', 'evmmigration', 'evmtransactionpayment', 'fellowshipcollective', 'fellowshipreferenda', 'financialcouncil', 'financialcouncilmembership', 'foreignassets', 'fungible', 'identity', 'inflation', 'maintenance', 'nonfungible', 'origins', 'parachaininfo', 'parachainsystem', 'polkadotxcm', 'preimage', 'refungible', 'scheduler', 'session', 'statetriemigration', 'structure', 'sudo', 'system', 'technicalcommittee', 'technicalcommitteemembership', 'timestamp', 'transactionpayment', 'treasury', 'unique', 'utility', 'vesting', 'xcmpqueue', 'xtokens' ] to deeply equal [ 'apppromotion', 'aura', 'auraext', 'authorship', 'balances', 'balancesadapter', 'charging', 'collatorselection', 'common', 'configuration', 'council', 'councilmembership', 'cumulusxcm', 'democracy', 'dmpqueue', 'ethereum', 'evm', 'evmcodersubstrate', 'evmcontracthelpers', 'evmmigration', 'evmtransactionpayment', 'fellowshipcollective', 'fellowshipreferenda', 'foreignassets', 'fungible', 'identity', 'inflation', 'maintenance', 'nonfungible', 'origins', 'parachaininfo', 'parachainsystem', 'polkadotxcm', 'preimage', 'refungible', 'scheduler', 'session', 'statetriemigration', 'structure', 'sudo', 'system', 'technicalcommittee', 'technicalcommitteemembership', 'timestamp', 'transactionpayment', 'treasury', 'unique', 'utility', 'vesting', 'xcmpqueue', 'xtokens' ]
|
► Pallet presence ► No extra pallets are included:
js-packages/tests/mochawesome-report/test-1711461854.json#L0
Failed test found in:
js-packages/tests/mochawesome-report/test-1711461854.json
Error:
AssertionError: expected [ 'apppromotion', 'aura', 'auraext', 'authorship', 'balances', 'balancesadapter', 'charging', 'collatorselection', 'common', 'configuration', 'council', 'councilmembership', 'cumulusxcm', 'democracy', 'dmpqueue', 'ethereum', 'evm', 'evmcodersubstrate', 'evmcontracthelpers', 'evmmigration', 'evmtransactionpayment', 'fellowshipcollective', 'fellowshipreferenda', 'financialcouncil', 'financialcouncilmembership', 'foreignassets', 'fungible', 'identity', 'inflation', 'maintenance', 'nonfungible', 'origins', 'parachaininfo', 'parachainsystem', 'polkadotxcm', 'preimage', 'refungible', 'scheduler', 'session', 'statetriemigration', 'structure', 'sudo', 'system', 'technicalcommittee', 'technicalcommitteemembership', 'timestamp', 'transactionpayment', 'treasury', 'unique', 'utility', 'vesting', 'xcmpqueue', 'xtokens' ] to deeply equal [ 'apppromotion', 'aura', 'auraext', 'authorship', 'balances', 'balancesadapter', 'charging', 'collatorselection', 'common', 'configuration', 'council', 'councilmembership', 'cumulusxcm', 'democracy', 'dmpqueue', 'ethereum', 'evm', 'evmcodersubstrate', 'evmcontracthelpers', 'evmmigration', 'evmtransactionpayment', 'fellowshipcollective', 'fellowshipreferenda', 'foreignassets', 'fungible', 'identity', 'inflation', 'maintenance', 'nonfungible', 'origins', 'parachaininfo', 'parachainsystem', 'polkadotxcm', 'preimage', 'refungible', 'scheduler', 'session', 'statetriemigration', 'structure', 'sudo', 'system', 'technicalcommittee', 'technicalcommitteemembership', 'timestamp', 'transactionpayment', 'treasury', 'unique', 'utility', 'vesting', 'xcmpqueue', 'xtokens' ]
|
codestyle / rustfmt
Node.js 16 actions are deprecated. Please update the following actions to use Node.js 20: actions/[email protected], xom9ikk/dotenv@v2. For more information see: https://github.blog/changelog/2023-09-22-github-actions-transitioning-from-node-16-to-node-20/.
|
codestyle / yarn_eslint:
js-packages/playgrounds/unique.ts#L228
toHuman results in horrible, hard to debug conversions with no stability guarantees, use Codec/at least .toJson instead
|
codestyle / yarn_eslint:
js-packages/playgrounds/unique.ts#L252
toHuman results in horrible, hard to debug conversions with no stability guarantees, use Codec/at least .toJson instead
|
codestyle / yarn_eslint:
js-packages/playgrounds/unique.ts#L287
toHuman results in horrible, hard to debug conversions with no stability guarantees, use Codec/at least .toJson instead
|
codestyle / yarn_eslint:
js-packages/playgrounds/unique.ts#L288
toHuman results in horrible, hard to debug conversions with no stability guarantees, use Codec/at least .toJson instead
|
codestyle / yarn_eslint:
js-packages/playgrounds/unique.ts#L335
toHuman results in horrible, hard to debug conversions with no stability guarantees, use Codec/at least .toJson instead
|
codestyle / yarn_eslint:
js-packages/playgrounds/unique.ts#L335
toHuman results in horrible, hard to debug conversions with no stability guarantees, use Codec/at least .toJson instead
|
codestyle / yarn_eslint:
js-packages/playgrounds/unique.ts#L339
toHuman results in horrible, hard to debug conversions with no stability guarantees, use Codec/at least .toJson instead
|
codestyle / yarn_eslint:
js-packages/playgrounds/unique.ts#L343
toHuman results in horrible, hard to debug conversions with no stability guarantees, use Codec/at least .toJson instead
|
codestyle / yarn_eslint:
js-packages/playgrounds/unique.ts#L371
Variable name `InvalidTypeSymbol` must match one of the following formats: camelCase, UPPER_CASE
|
codestyle / yarn_eslint:
js-packages/playgrounds/unique.ts#L588
toHuman results in horrible, hard to debug conversions with no stability guarantees, use Codec/at least .toJson instead
|