Skip to content

This PR contains the following updates: #2773

This PR contains the following updates:

This PR contains the following updates: #2773

GitHub Actions / Test Report - gradle testShardHibernate -i --scan --no-parallel failed Feb 3, 2025 in 0s

257 tests run, 254 passed, 1 skipped, 2 failed.

Annotations

Check failure on line 39 in misk-jobqueue/src/test/kotlin/misk/jobqueue/DevelopmentJobQueueTest.kt

See this annotation in the file changed.

@github-actions github-actions / Test Report - gradle testShardHibernate -i --scan --no-parallel

DevelopmentJobQueueTest.batch()

java.lang.AssertionError: 
Expecting actual:
  []
to contain exactly in any order:
  ["received RED job with message: stop sign",
    "received RED job with message: apple"]
but could not find the following elements:
  ["received RED job with message: stop sign",
    "received RED job with message: apple"]
Raw output
java.lang.AssertionError: 
Expecting actual:
  []
to contain exactly in any order:
  ["received RED job with message: stop sign",
    "received RED job with message: apple"]
but could not find the following elements:
  ["received RED job with message: stop sign",
    "received RED job with message: apple"]

	at misk.jobqueue.DevelopmentJobQueueTest.batch(DevelopmentJobQueueTest.kt:39)
	at java.base/java.lang.reflect.Method.invoke(Method.java:568)
	at java.base/java.util.ArrayList.forEach(ArrayList.java:1511)
	at java.base/java.util.ArrayList.forEach(ArrayList.java:1511)

Check failure on line 39 in misk-jobqueue/src/test/kotlin/misk/jobqueue/DevelopmentJobQueueTest.kt

See this annotation in the file changed.

@github-actions github-actions / Test Report - gradle testShardHibernate -i --scan --no-parallel

DevelopmentJobQueueTest.batch()

java.lang.AssertionError: 
Expecting actual:
  ["received RED job with message: stop sign"]
to contain exactly in any order:
  ["received RED job with message: stop sign",
    "received RED job with message: apple"]
but could not find the following elements:
  ["received RED job with message: apple"]
Raw output
java.lang.AssertionError: 
Expecting actual:
  ["received RED job with message: stop sign"]
to contain exactly in any order:
  ["received RED job with message: stop sign",
    "received RED job with message: apple"]
but could not find the following elements:
  ["received RED job with message: apple"]

	at misk.jobqueue.DevelopmentJobQueueTest.batch(DevelopmentJobQueueTest.kt:39)
	at java.base/java.lang.reflect.Method.invoke(Method.java:568)
	at java.base/java.util.ArrayList.forEach(ArrayList.java:1511)
	at java.base/java.util.ArrayList.forEach(ArrayList.java:1511)