Skip to content

perf: dump immediatly if known size exceeds limit #12919

perf: dump immediatly if known size exceeds limit

perf: dump immediatly if known size exceeds limit #12919

Re-run triggered March 10, 2024 20:58
Status Failure
Total duration 2m 24s
Artifacts

nodejs.yml

on: pull_request
Matrix: test
dependency-review
10s
dependency-review
Lint
30s
Lint
Test TypeScript types
33s
Test TypeScript types
automerge
0s
automerge
Fit to window
Zoom out
Zoom in

Annotations

6 errors and 30 notices
request dump big: test\client-request.js#L25
Error [ERR_TEST_FAILURE]: Failed at process.emit (node:events:519:28) { code: 'ERR_TEST_FAILURE', failureType: 'uncaughtException', cause: AssertionError [ERR_ASSERTION]: Failed at res.<computed> [as fail] (D:\a\undici\undici\node_modules\@matteo.collina\tspl\tspl.js:52:35) at ServerResponse.<anonymous> (D:\a\undici\undici\test\client-request.js:25:29) at ServerResponse.emit (node:events:519:28) at socketOnDrain (node:_http_server:770:9) at Socket.emit (node:events:519:28) at afterWrite (node:internal/streams/writable:696:12) at afterWriteTick (node:internal/streams/writable:687:10) at process.processTicksAndRejections (node:internal/process/task_queues:81:21) { generatedMessage: true, code: 'ERR_ASSERTION', actual: undefined, expected: undefined, operator: 'fail' } }
Test with Node.js 21 on windows-latest
Process completed with exit code 1.
request dump big: test\client-request.js#L25
Error [ERR_TEST_FAILURE]: Failed at process.emit (node:events:518:28) { code: 'ERR_TEST_FAILURE', failureType: 'uncaughtException', cause: AssertionError [ERR_ASSERTION]: Failed at res.<computed> [as fail] (D:\a\undici\undici\node_modules\@matteo.collina\tspl\tspl.js:52:35) at ServerResponse.<anonymous> (D:\a\undici\undici\test\client-request.js:25:29) at ServerResponse.emit (node:events:518:28) at socketOnDrain (node:_http_server:769:9) at Socket.emit (node:events:518:28) at afterWrite (node:internal/streams/writable:696:12) at afterWriteTick (node:internal/streams/writable:687:10) at process.processTicksAndRejections (node:internal/process/task_queues:81:21) { generatedMessage: true, code: 'ERR_ASSERTION', actual: undefined, expected: undefined, operator: 'fail' } }
Test with Node.js 20 on windows-latest
Process completed with exit code 1.
request dump big: test\client-request.js#L25
Error [ERR_TEST_FAILURE]: Failed at process.emit (node:events:517:28) { failureType: 'uncaughtException', cause: AssertionError [ERR_ASSERTION]: Failed at res.<computed> [as fail] (D:\a\undici\undici\node_modules\@matteo.collina\tspl\tspl.js:52:35) at ServerResponse.<anonymous> (D:\a\undici\undici\test\client-request.js:25:29) at ServerResponse.emit (node:events:517:28) at socketOnDrain (node:_http_server:758:9) at Socket.emit (node:events:517:28) at afterWrite (node:internal/streams/writable:495:12) at afterWriteTick (node:internal/streams/writable:487:10) at process.processTicksAndRejections (node:internal/process/task_queues:81:21) { generatedMessage: true, code: 'ERR_ASSERTION', actual: undefined, expected: undefined, operator: 'fail' }, code: 'ERR_TEST_FAILURE' }
Test with Node.js 18 on windows-latest
Process completed with exit code 1.
Test with Node.js 18 on ubuntu-latest
Total Tests: 727 Suites 📂: 50 Passed ✅: 724 Failed ❌: 0 Canceled 🚫: 0 Skipped ⏭️: 3 Todo 📝: 0 Duration 🕐: 34997.642ms
Test with Node.js 18 on ubuntu-latest
Total Tests: 189 Suites 📂: 6 Passed ✅: 176 Failed ❌: 0 Canceled 🚫: 0 Skipped ⏭️: 13 Todo 📝: 0 Duration 🕐: 3205.738ms
Test with Node.js 18 on ubuntu-latest
Total Tests: 348 Suites 📂: 8 Passed ✅: 348 Failed ❌: 0 Canceled 🚫: 0 Skipped ⏭️: 0 Todo 📝: 0 Duration 🕐: 10971.938ms
Test with Node.js 18 on ubuntu-latest
Total Tests: 15 Suites 📂: 2 Passed ✅: 15 Failed ❌: 0 Canceled 🚫: 0 Skipped ⏭️: 0 Todo 📝: 0 Duration 🕐: 129.930ms
Test with Node.js 18 on ubuntu-latest
Total Tests: 1 Suites 📂: 1 Passed ✅: 1 Failed ❌: 0 Canceled 🚫: 0 Skipped ⏭️: 0 Todo 📝: 0 Duration 🕐: 218.533ms
Test with Node.js 18 on ubuntu-latest
Total Tests: 66 Suites 📂: 6 Passed ✅: 66 Failed ❌: 0 Canceled 🚫: 0 Skipped ⏭️: 0 Todo 📝: 0 Duration 🕐: 1687.240ms
Test with Node.js 18 on ubuntu-latest
Total Tests: 93 Suites 📂: 16 Passed ✅: 93 Failed ❌: 0 Canceled 🚫: 0 Skipped ⏭️: 0 Todo 📝: 0 Duration 🕐: 11127.419ms
Test with Node.js 18 on ubuntu-latest
Total Tests: 66 Suites 📂: 12 Passed ✅: 66 Failed ❌: 0 Canceled 🚫: 0 Skipped ⏭️: 0 Todo 📝: 0 Duration 🕐: 3965.188ms
Test with Node.js 18 on ubuntu-latest
Total Tests: 203 Suites 📂: 3 Passed ✅: 203 Failed ❌: 0 Canceled 🚫: 0 Skipped ⏭️: 0 Todo 📝: 0 Duration 🕐: 7251.264ms
Test with Node.js 20 on ubuntu-latest
Total Tests: 727 Suites 📂: 50 Passed ✅: 724 Failed ❌: 0 Canceled 🚫: 0 Skipped ⏭️: 3 Todo 📝: 0 Duration 🕐: 36846.070ms
Test with Node.js 20 on ubuntu-latest
Total Tests: 189 Suites 📂: 6 Passed ✅: 176 Failed ❌: 0 Canceled 🚫: 0 Skipped ⏭️: 13 Todo 📝: 0 Duration 🕐: 3266.586ms
Test with Node.js 20 on ubuntu-latest
Total Tests: 348 Suites 📂: 8 Passed ✅: 348 Failed ❌: 0 Canceled 🚫: 0 Skipped ⏭️: 0 Todo 📝: 0 Duration 🕐: 10986.598ms
Test with Node.js 20 on ubuntu-latest
Total Tests: 15 Suites 📂: 2 Passed ✅: 15 Failed ❌: 0 Canceled 🚫: 0 Skipped ⏭️: 0 Todo 📝: 0 Duration 🕐: 123.305ms
Test with Node.js 20 on ubuntu-latest
Total Tests: 1 Suites 📂: 1 Passed ✅: 1 Failed ❌: 0 Canceled 🚫: 0 Skipped ⏭️: 0 Todo 📝: 0 Duration 🕐: 185.975ms
Test with Node.js 20 on ubuntu-latest
Total Tests: 66 Suites 📂: 6 Passed ✅: 66 Failed ❌: 0 Canceled 🚫: 0 Skipped ⏭️: 0 Todo 📝: 0 Duration 🕐: 1620.684ms
Test with Node.js 20 on ubuntu-latest
Total Tests: 93 Suites 📂: 16 Passed ✅: 93 Failed ❌: 0 Canceled 🚫: 0 Skipped ⏭️: 0 Todo 📝: 0 Duration 🕐: 11255.884ms
Test with Node.js 20 on ubuntu-latest
Total Tests: 66 Suites 📂: 12 Passed ✅: 66 Failed ❌: 0 Canceled 🚫: 0 Skipped ⏭️: 0 Todo 📝: 0 Duration 🕐: 3986.231ms
Test with Node.js 20 on ubuntu-latest
Total Tests: 203 Suites 📂: 3 Passed ✅: 203 Failed ❌: 0 Canceled 🚫: 0 Skipped ⏭️: 0 Todo 📝: 0 Duration 🕐: 7400.609ms
Test with Node.js 21 on ubuntu-latest
Total Tests: 727 Suites 📂: 50 Passed ✅: 724 Failed ❌: 0 Canceled 🚫: 0 Skipped ⏭️: 3 Todo 📝: 0 Duration 🕐: 35087.496ms
Test with Node.js 21 on ubuntu-latest
Total Tests: 189 Suites 📂: 6 Passed ✅: 176 Failed ❌: 0 Canceled 🚫: 0 Skipped ⏭️: 13 Todo 📝: 0 Duration 🕐: 3129.608ms
Test with Node.js 21 on ubuntu-latest
Total Tests: 348 Suites 📂: 8 Passed ✅: 348 Failed ❌: 0 Canceled 🚫: 0 Skipped ⏭️: 0 Todo 📝: 0 Duration 🕐: 10812.144ms
Test with Node.js 21 on ubuntu-latest
Total Tests: 15 Suites 📂: 2 Passed ✅: 15 Failed ❌: 0 Canceled 🚫: 0 Skipped ⏭️: 0 Todo 📝: 0 Duration 🕐: 109.879ms
Test with Node.js 21 on ubuntu-latest
Total Tests: 1 Suites 📂: 1 Passed ✅: 1 Failed ❌: 0 Canceled 🚫: 0 Skipped ⏭️: 0 Todo 📝: 0 Duration 🕐: 193.335ms
Test with Node.js 21 on ubuntu-latest
Total Tests: 66 Suites 📂: 6 Passed ✅: 66 Failed ❌: 0 Canceled 🚫: 0 Skipped ⏭️: 0 Todo 📝: 0 Duration 🕐: 1526.417ms
Test with Node.js 21 on ubuntu-latest
Total Tests: 93 Suites 📂: 16 Passed ✅: 93 Failed ❌: 0 Canceled 🚫: 0 Skipped ⏭️: 0 Todo 📝: 0 Duration 🕐: 11022.517ms
Test with Node.js 21 on ubuntu-latest
Total Tests: 66 Suites 📂: 12 Passed ✅: 66 Failed ❌: 0 Canceled 🚫: 0 Skipped ⏭️: 0 Todo 📝: 0 Duration 🕐: 3741.225ms
Test with Node.js 21 on ubuntu-latest
Total Tests: 203 Suites 📂: 3 Passed ✅: 203 Failed ❌: 0 Canceled 🚫: 0 Skipped ⏭️: 0 Todo 📝: 0 Duration 🕐: 6833.333ms
Test with Node.js 21 on windows-latest
Total Tests: 727 Suites 📂: 50 Passed ✅: 723 Failed ❌: 1 Canceled 🚫: 0 Skipped ⏭️: 3 Todo 📝: 0 Duration 🕐: 39064.850ms
Test with Node.js 20 on windows-latest
Total Tests: 727 Suites 📂: 50 Passed ✅: 723 Failed ❌: 1 Canceled 🚫: 0 Skipped ⏭️: 3 Todo 📝: 0 Duration 🕐: 42383.829ms
Test with Node.js 18 on windows-latest
Total Tests: 727 Suites 📂: 50 Passed ✅: 723 Failed ❌: 1 Canceled 🚫: 0 Skipped ⏭️: 3 Todo 📝: 0 Duration 🕐: 41275.516ms