Dependency Updater #526
Annotations
3 errors and 2 warnings
build
PR BUILD not successfull. Check artifacts for logs.
|
build
Process completed with exit code 1.
|
build
Process completed with exit code 3.
|
build
===========================================================
product-is BUILD FAILURE
==========================================================
[INFO] Results:
[INFO]
[ERROR] Failures:
[ERROR] org.wso2.identity.integration.test.EmailOTPTestCase.testEmailOTPAuthentication(org.wso2.identity.integration.test.EmailOTPTestCase)
[INFO] Run 1: PASS
[ERROR] Run 2: EmailOTPTestCase.testEmailOTPAuthentication:196 Error in redirection to email OTP authentication page for user: testuser1 expected:<true> but was:<false>
[INFO]
[ERROR] org.wso2.identity.integration.test.actions.preupdatepassword.PreUpdatePasswordActionFailureTestCase.testUserResetPassword(org.wso2.identity.integration.test.actions.preupdatepassword.PreUpdatePasswordActionFailureTestCase)
[ERROR] Run 1: PreUpdatePasswordActionFailureTestCase.testUserResetPassword:239 expected:<true> but was:<false>
[ERROR] Run 2: PreUpdatePasswordActionFailureTestCase.testUserResetPassword:237 expected:<true> but was:<false>
[ERROR] Run 3: PreUpdatePasswordActionFailureTestCase.testUserResetPassword:234 expected:<200> but was:<500>
[ERROR] Run 4: PreUpdatePasswordActionFailureTestCase.testUserResetPassword:234 expected:<200> but was:<500>
[INFO]
[ERROR] org.wso2.identity.integration.test.recovery.UsernameRecoveryTestCase.testUsernameRecoveryForSmsOnly(org.wso2.identity.integration.test.recovery.UsernameRecoveryTestCase)
[ERROR] Run 1: UsernameRecoveryTestCase.testUsernameRecoveryForSmsOnly:214 Received username does not match. expected:<PRIMARY/testUser1
> but was:<PRIMARY/testUser1>
[ERROR] Run 2: UsernameRecoveryTestCase.testUsernameRecoveryForSmsOnly:214 Received username does not match. expected:<PRIMARY/testUser1
> but was:<WSO2TEST.COM/testUser1>
[INFO]
[ERROR] org.wso2.identity.integration.test.recovery.UsernameRecoveryTestCase.testUsernameRecoveryWithBothChannels(org.wso2.identity.integration.test.recovery.UsernameRecoveryTestCase)
[ERROR] Run 1: UsernameRecoveryTestCase.testUsernameRecoveryWithBothChannels:229->OIDCAbstractIntegrationTest.createUser:95 User creation failed expected:<201> but was:<409>
[ERROR] Run 2: UsernameRecoveryTestCase.testUsernameRecoveryWithBothChannels:229->OIDCAbstractIntegrationTest.createUser:95 User creation failed expected:<201> but was:<409>
[ERROR] Run 3: UsernameRecoveryTestCase.testUsernameRecoveryWithBothChannels:229->OIDCAbstractIntegrationTest.createUser:95 User creation failed expected:<201> but was:<409>
[ERROR] Run 4: UsernameRecoveryTestCase.testUsernameRecoveryWithBothChannels:229->OIDCAbstractIntegrationTest.createUser:95 User creation failed expected:<201> but was:<409>
[INFO]
[ERROR] UsernameRecoveryTestCase.testUsernameRecoveryWithMultipleUsersSupport:279->validateUsernameForMultipleUserInMail:539 Not all expected usernames were found in the emails. expected:<true> but was:<false>
[INFO]
[ERROR] Tests run: 3335, Failures: 5, Errors: 0, Skipped: 3
[INFO]
[INFO] ------------------------------------------------------------------------
[INFO] Reactor Summary for WSO2 Identity Server 7.1.0-beta2-SNAPSHOT:
[INFO]
[INFO] WSO2 Identity Server ............................... SUCCESS [ 18.384 s]
[INFO] WSO2 Identity Server Styles Parent ................. SUCCESS [ 0.572 s]
[INFO] Identity Server: UI styles ......................... SUCCESS [ 17.774 s]
[INFO] WSO2 IS - Features Aggregator Module ............... SUCCESS [ 0.017 s]
[INFO] WSO2 IS - Style Features ........................... SUCCESS [ 7.625 s]
[INFO] WSO2 IS - Utils Features ........................... SUCCESS [ 2.135 s]
[INFO] WSO2 Carbon - Identity UI Feature .................. SUCCESS [ 2.345 s]
[INFO] WSO2 IS - IS Profile Generation .................... SUCCESS [ 58.989 s]
[INFO] Identity Server : Connector ........................ SUCCESS [ 1.334 s]
[INFO] WSO2 Identity Server - Rest API .................... SUCCESS [ 0.009 s]
[INFO] WSO2 Identity Server - All Rest API ................ SUCCESS [01:21 min]
[INFO] Identity Server : identity-authenticators .......... SUCCESS [ 0.291 s]
[INFO] Identity Server : Social-au
|
build
Cache not found for keys: Linux-maven-cache-m2-e7bd88f3296ec2580ed439d3bf64238b71564a737efb6b4c8c5d8bdbe6af2c98, Linux-maven-cache-m2-, Linux-maven-, Linux-
|
Artifacts
Produced during runtime
Name | Size | |
---|---|---|
dependency-updates-diff
|
1.08 KB |
|
mvn-build.log
|
1.11 MB |
|