Skip to content

Dependency Updater #527

Dependency Updater

Dependency Updater #527

Triggered via schedule February 14, 2025 15:04
Status Failure
Total duration 1h 41m 32s
Artifacts 2

dependency-updater.yml

on: schedule
Fit to window
Zoom out
Zoom in

Annotations

3 errors and 2 warnings
build
PR BUILD not successfull. Check artifacts for logs.
build
Process completed with exit code 1.
build
Process completed with exit code 3.
build
=========================================================== product-is BUILD FAILURE ========================================================== [INFO] Results: [INFO] [ERROR] Failures: [ERROR] org.wso2.identity.integration.test.actions.preupdatepassword.PreUpdatePasswordActionFailureTestCase.testUserResetPassword(org.wso2.identity.integration.test.actions.preupdatepassword.PreUpdatePasswordActionFailureTestCase) [ERROR] Run 1: PreUpdatePasswordActionFailureTestCase.testUserResetPassword:239 expected:<true> but was:<false> [ERROR] Run 2: PreUpdatePasswordActionFailureTestCase.testUserResetPassword:234 expected:<200> but was:<500> [ERROR] Run 3: PreUpdatePasswordActionFailureTestCase.testUserResetPassword:237 expected:<true> but was:<false> [ERROR] Run 4: PreUpdatePasswordActionFailureTestCase.testUserResetPassword:234 expected:<200> but was:<500> [INFO] [INFO] [ERROR] Tests run: 3340, Failures: 1, Errors: 0, Skipped: 3 [INFO] [INFO] ------------------------------------------------------------------------ [INFO] Reactor Summary for WSO2 Identity Server 7.1.0-beta2-SNAPSHOT: [INFO] [INFO] WSO2 Identity Server ............................... SUCCESS [ 7.932 s] [INFO] WSO2 Identity Server Styles Parent ................. SUCCESS [ 0.746 s] [INFO] Identity Server: UI styles ......................... SUCCESS [ 9.066 s] [INFO] WSO2 IS - Features Aggregator Module ............... SUCCESS [ 0.016 s] [INFO] WSO2 IS - Style Features ........................... SUCCESS [ 4.580 s] [INFO] WSO2 IS - Utils Features ........................... SUCCESS [ 0.970 s] [INFO] WSO2 Carbon - Identity UI Feature .................. SUCCESS [ 1.854 s] [INFO] WSO2 IS - IS Profile Generation .................... SUCCESS [ 42.238 s] [INFO] Identity Server : Connector ........................ SUCCESS [ 0.473 s] [INFO] WSO2 Identity Server - Rest API .................... SUCCESS [ 0.008 s] [INFO] WSO2 Identity Server - All Rest API ................ SUCCESS [ 39.775 s] [INFO] Identity Server : identity-authenticators .......... SUCCESS [ 0.138 s] [INFO] Identity Server : Social-authenticators ............ SUCCESS [ 0.354 s] [INFO] Identity Server : Provisioning Connectors .......... SUCCESS [ 0.208 s] [INFO] Identity Server : identity-local-authenticators .... SUCCESS [ 0.320 s] [INFO] Identity Server : oauth2-grant-types ............... SUCCESS [ 0.095 s] [INFO] Identity Server : identity-integration-ui-templates SUCCESS [ 0.505 s] [INFO] Identity Server .................................... SUCCESS [ 36.112 s] [INFO] WSO2 Identity Integration Test Utils ............... SUCCESS [ 0.008 s] [INFO] org.wso2.carbon.identity.test.integration.service .. SUCCESS [ 2.429 s] [INFO] org.wso2.carbon.identity.test.integration.service.stubs SUCCESS [ 6.549 s] [INFO] Identity Server Integration Tests .................. SUCCESS [ 10.598 s] [INFO] WSO2 IS - Integration Test Admin Clients Module .... SUCCESS [ 5.637 s] [INFO] WSO2 IS - Integration UI Pages Module .............. SUCCESS [ 1.815 s] [INFO] WSO2 IS - Integration Test Utils Module ............ SUCCESS [ 4.004 s] [INFO] jacoco-report-generator ............................ SUCCESS [ 2.683 s] [INFO] WSO2 Identity Integration Test Common .............. SUCCESS [ 1.065 s] [INFO] Identity Test Back-end Module ...................... FAILURE [ 01:35 h] [INFO] org.wso2.identity.integration.test ................. SKIPPED [INFO] ------------------------------------------------------------------------ [INFO] BUILD FAILURE [INFO] ------------------------------------------------------------------------ [INFO] Total time: 01:38 h [INFO] Finished at: 2025-02-14T16:45:53Z [INFO] ------------------------------------------------------------------------ [ERROR] Failed to execute goal org.apache.maven.plugins:maven-surefire-plugin:2.22.1:test (default-test) on project org.wso2.carbon.identity.integration.backend.test: There are test failures. [ERROR] [ERROR] Please refer to /home/runner/work/product-is/product-is/product-is/modules/integration/tests-integration/tests-ba
build
Cache not found for keys: Linux-maven-cache-m2-e7bd88f3296ec2580ed439d3bf64238b71564a737efb6b4c8c5d8bdbe6af2c98, Linux-maven-cache-m2-, Linux-maven-, Linux-

Artifacts

Produced during runtime
Name Size
dependency-updates-diff
874 Bytes
mvn-build.log
1.1 MB