Dependency Updater #531
Annotations
3 errors and 2 warnings
build
PR BUILD not successfull. Check artifacts for logs.
|
build
Process completed with exit code 1.
|
build
Process completed with exit code 3.
|
build
===========================================================
product-is BUILD FAILURE
==========================================================
[INFO] Results:
[INFO]
[ERROR] Failures:
[ERROR] UserSessionAdminSuccessTest.testConclude:96 NullPointer
[ERROR] UserSessionAdminSuccessTest>UserSessionTest.testInitData:134->UserSessionTest.createServiceProvider:231 » Remote
[INFO]
[ERROR] Tests run: 3364, Failures: 2, Errors: 0, Skipped: 6
[INFO]
[INFO] ------------------------------------------------------------------------
[INFO] Reactor Summary for WSO2 Identity Server 7.1.0-beta2-SNAPSHOT:
[INFO]
[INFO] WSO2 Identity Server ............................... SUCCESS [ 9.038 s]
[INFO] WSO2 Identity Server Styles Parent ................. SUCCESS [ 0.343 s]
[INFO] Identity Server: UI styles ......................... SUCCESS [ 10.942 s]
[INFO] WSO2 IS - Features Aggregator Module ............... SUCCESS [ 0.018 s]
[INFO] WSO2 IS - Style Features ........................... SUCCESS [ 4.062 s]
[INFO] WSO2 IS - Utils Features ........................... SUCCESS [ 1.104 s]
[INFO] WSO2 Carbon - Identity UI Feature .................. SUCCESS [ 1.939 s]
[INFO] WSO2 IS - IS Profile Generation .................... SUCCESS [ 45.810 s]
[INFO] Identity Server : Connector ........................ SUCCESS [ 0.642 s]
[INFO] WSO2 Identity Server - Rest API .................... SUCCESS [ 0.013 s]
[INFO] WSO2 Identity Server - All Rest API ................ SUCCESS [ 47.464 s]
[INFO] Identity Server : identity-authenticators .......... SUCCESS [ 0.181 s]
[INFO] Identity Server : Social-authenticators ............ SUCCESS [ 0.403 s]
[INFO] Identity Server : Provisioning Connectors .......... SUCCESS [ 0.251 s]
[INFO] Identity Server : identity-local-authenticators .... SUCCESS [ 0.415 s]
[INFO] Identity Server : oauth2-grant-types ............... SUCCESS [ 0.084 s]
[INFO] Identity Server : identity-integration-ui-templates SUCCESS [ 0.567 s]
[INFO] Identity Server .................................... SUCCESS [ 40.618 s]
[INFO] WSO2 Identity Integration Test Utils ............... SUCCESS [ 0.008 s]
[INFO] org.wso2.carbon.identity.test.integration.service .. SUCCESS [ 2.721 s]
[INFO] org.wso2.carbon.identity.test.integration.service.stubs SUCCESS [ 6.205 s]
[INFO] Identity Server Integration Tests .................. SUCCESS [ 12.474 s]
[INFO] WSO2 IS - Integration Test Admin Clients Module .... SUCCESS [ 6.152 s]
[INFO] WSO2 IS - Integration UI Pages Module .............. SUCCESS [ 2.635 s]
[INFO] WSO2 IS - Integration Test Utils Module ............ SUCCESS [ 4.603 s]
[INFO] jacoco-report-generator ............................ SUCCESS [ 2.969 s]
[INFO] WSO2 Identity Integration Test Common .............. SUCCESS [ 1.165 s]
[INFO] Identity Test Back-end Module ...................... FAILURE [ 01:34 h]
[INFO] org.wso2.identity.integration.test ................. SKIPPED
[INFO] ------------------------------------------------------------------------
[INFO] BUILD FAILURE
[INFO] ------------------------------------------------------------------------
[INFO] Total time: 01:37 h
[INFO] Finished at: 2025-02-18T16:45:36Z
[INFO] ------------------------------------------------------------------------
[ERROR] Failed to execute goal org.apache.maven.plugins:maven-surefire-plugin:2.22.1:test (default-test) on project org.wso2.carbon.identity.integration.backend.test: There are test failures.
[ERROR]
[ERROR] Please refer to /home/runner/work/product-is/product-is/product-is/modules/integration/tests-integration/tests-backend/target/surefire-reports for the individual test results.
[ERROR] Please refer to dump files (if any exist) [date].dump, [date]-jvmRun[N].dump and [date].dumpstream.
[ERROR] -> [Help 1]
[ERROR]
[ERROR] To see the full stack trace of the errors, re-run Maven with the -e switch.
[ERROR] Re-run Maven using the -X switch to enable full debug logging.
[ERROR]
[ERROR] For more information about the errors and possible solutions, please read the following articles:
[ERROR] [Help 1] http
|
build
Cache not found for keys: Linux-maven-cache-m2-e7bd88f3296ec2580ed439d3bf64238b71564a737efb6b4c8c5d8bdbe6af2c98, Linux-maven-cache-m2-, Linux-maven-, Linux-
|
Artifacts
Produced during runtime
Name | Size | |
---|---|---|
dependency-updates-diff
|
900 Bytes |
|
mvn-build.log
|
945 KB |
|