Unique Chain 1.14 #2709
Triggered via pull request
February 24, 2025 09:13
Status
Failure
Total duration
14h 24m 45s
Artifacts
3
ci-develop.yml
on: pull_request
collator-selection
/
Prepare execution matrix
governance
/
Prepare execution matrix
main-process
/
execution matrix
24s
try-runtime
/
Prepare execution matrix
xcm
/
Prepare execution matrix
xnft
/
Prepare execution matrix
unit-test
/
develop
10m 36s
codestyle
/
rustfmt
16s
codestyle
/
yarn_eslint
23s
codestyle
/
clippy
2m 33s
Matrix: polkadot-types / polkadot_generate_types
Waiting for pending jobs
Matrix: yarn-dev / dev_build_int_tests
Matrix: collator-selection / collator-selection
Waiting for pending jobs
Matrix: governance / dev_build_int_tests
Waiting for pending jobs
Matrix: main-process / main-process
Matrix: try-runtime / try-runtime
Waiting for pending jobs
Matrix: xcm / xcm
Waiting for pending jobs
Matrix: xnft / xnft
Waiting for pending jobs
Annotations
51 errors and 13 warnings
codestyle / yarn_eslint:
js-packages/test-utils/eth/tx.ts#L130
Missing semicolon
|
codestyle / yarn_eslint:
js-packages/test-utils/eth/tx.ts#L134
Missing semicolon
|
codestyle / yarn_eslint
Process completed with exit code 1.
|
(!negative tests!) Create NFT collection from EVM ► (!negative tests!) Create NFT collection from EVM ► destroyCollection:
js-packages/tests/mochawesome-report/test-1740389103.json#L0
Failed test found in:
js-packages/tests/mochawesome-report/test-1740389103.json
Error:
AssertionError: expected { CollectionDestroyed: { address: '0x6C4E9fE1AE37a41E93CEE429e8E1881aBdcbb54F', event: 'CollectionDestroyed', returnValues: { collectionId: '0x17C4e6453cC49AaAaEaca894e6D9683e0000018F' } } } to deeply equal [ { address: '0x6C4E9fE1AE37a41E93CEE429e8E1881aBdcbb54F', event: 'CollectionDestroyed', args: { collectionId: '0x17C4e6453cC49AaAaEaca894e6D9683e0000018F' } } ]
|
[FT] Sync sub & eth events ► [FT] Sync sub & eth events ► CollectionCreated and CollectionDestroyed events:
js-packages/tests/mochawesome-report/test-1740389103.json#L0
Failed test found in:
js-packages/tests/mochawesome-report/test-1740389103.json
Error:
AssertionError: expected { CollectionCreated: { address: '0x6C4E9fE1AE37a41E93CEE429e8E1881aBdcbb54F', event: 'CollectionCreated', returnValues: { owner: '0x36935a12E1a1Ee6aA9b1994Ba59655c73e25bf7e', collectionId: '0x17c4e6453cC49AAaaEacA894e6D9683e000001a0' } } } to contain subset [ { event: 'CollectionCreated', args: { owner: '0x36935a12E1a1Ee6aA9b1994Ba59655c73e25bf7e', collectionId: '0x17c4e6453cC49AAaaEacA894e6D9683e000001a0' } } ]
|
[NFT] Sync sub & eth events ► [NFT] Sync sub & eth events ► CollectionChanged event for TokenPropertySet, TokenPropertyDeleted:
js-packages/tests/mochawesome-report/test-1740389103.json#L0
Failed test found in:
js-packages/tests/mochawesome-report/test-1740389103.json
Error:
AssertionError: expected undefined to be like { event: 'TokenChanged', returnValues: { tokenId: '1' } }
|
[NFT] Sync sub & eth events ► [NFT] Sync sub & eth events ► CollectionCreated and CollectionDestroyed events:
js-packages/tests/mochawesome-report/test-1740389103.json#L0
Failed test found in:
js-packages/tests/mochawesome-report/test-1740389103.json
Error:
AssertionError: expected { CollectionCreated: { address: '0x6C4E9fE1AE37a41E93CEE429e8E1881aBdcbb54F', event: 'CollectionCreated', returnValues: { owner: '0xB0c87849a6CCa6d8AA8A9fDB7e1C905bFb1c3A6f', collectionId: '0x17c4e6453cc49aaaaEaca894e6d9683E000001a8' } } } to contain subset [ { event: 'CollectionCreated', args: { owner: '0xB0c87849a6CCa6d8AA8A9fDB7e1C905bFb1c3A6f', collectionId: '0x17c4e6453cc49aaaaEaca894e6d9683E000001a8' } } ]
|
[RFT] Sync sub & eth events ► [RFT] Sync sub & eth events ► CollectionChanged event for TokenPropertySet, TokenPropertyDeleted:
js-packages/tests/mochawesome-report/test-1740389103.json#L0
Failed test found in:
js-packages/tests/mochawesome-report/test-1740389103.json
Error:
AssertionError: expected undefined to be like { event: 'TokenChanged', returnValues: { tokenId: '1' } }
|
[RFT] Sync sub & eth events ► [RFT] Sync sub & eth events ► CollectionCreated and CollectionDestroyed events:
js-packages/tests/mochawesome-report/test-1740389103.json#L0
Failed test found in:
js-packages/tests/mochawesome-report/test-1740389103.json
Error:
AssertionError: expected { CollectionCreated: { address: '0x6C4E9fE1AE37a41E93CEE429e8E1881aBdcbb54F', event: 'CollectionCreated', returnValues: { owner: '0xa556B417af18378C2A5Cf8A982BB8fC571f37BBD', collectionId: '0x17c4e6453CC49AAAAEAca894E6d9683E000001B2' } } } to contain subset [ { event: 'CollectionCreated', args: { owner: '0xa556B417af18378C2A5Cf8A982BB8fC571f37BBD', collectionId: '0x17c4e6453CC49AAAAEAca894E6d9683E000001B2' } } ]
|
Create collection from EVM ► Create collection from EVM Fungible collection ► destroyCollection:
js-packages/tests/mochawesome-report/test-1740389103.json#L0
Failed test found in:
js-packages/tests/mochawesome-report/test-1740389103.json
Error:
AssertionError: expected { CollectionDestroyed: { address: '0x6C4E9fE1AE37a41E93CEE429e8E1881aBdcbb54F', event: 'CollectionDestroyed', returnValues: { collectionId: '0x17C4E6453cc49aAAaeaca894E6D9683e00000145' } } } to deeply equal [ { address: '0x6C4E9fE1AE37a41E93CEE429e8E1881aBdcbb54F', event: 'CollectionDestroyed', args: { collectionId: '0x17C4E6453cc49aAAaeaca894E6D9683e00000145' } } ]
|
Create collection from EVM ► Create collection from EVM Nonfungible collection ► Create collection:
js-packages/tests/mochawesome-report/test-1740389103.json#L0
Failed test found in:
js-packages/tests/mochawesome-report/test-1740389103.json
Error:
AssertionError: expected { CollectionCreated: { address: '0x6C4E9fE1AE37a41E93CEE429e8E1881aBdcbb54F', event: 'CollectionCreated', returnValues: { owner: '0x2A94b90D5496EF4bD53cCd37f94243A692d0d159', collectionId: '0x17C4E6453cc49AAAaEAcA894E6d9683E00000146' } } } to deeply equal [ { address: '0x6C4E9fE1AE37a41E93CEE429e8E1881aBdcbb54F', event: 'CollectionCreated', args: { owner: '0x2A94b90D5496EF4bD53cCd37f94243A692d0d159', collectionId: '0x17C4E6453cc49AAAaEAcA894E6d9683E00000146' } } ]
|
Create collection from EVM ► Create collection from EVM Sponsoring ► Can sponsor from evm address via access list:
js-packages/tests/mochawesome-report/test-1740389103.json#L0
Failed test found in:
js-packages/tests/mochawesome-report/test-1740389103.json
Error:
TypeError: result.events.normalized.find is not a function
|
Create collection from EVM ► Create collection from EVM Sponsoring ► Check that transaction via EVM spend money from sponsor address:
js-packages/tests/mochawesome-report/test-1740389103.json#L0
Failed test found in:
js-packages/tests/mochawesome-report/test-1740389103.json
Error:
TypeError: mintingResult.events.normalized.find is not a function
|
Create FT collection from EVM ► Create FT collection from EVM ► destroyCollection:
js-packages/tests/mochawesome-report/test-1740389103.json#L0
Failed test found in:
js-packages/tests/mochawesome-report/test-1740389103.json
Error:
AssertionError: expected { CollectionDestroyed: { address: '0x6C4E9fE1AE37a41E93CEE429e8E1881aBdcbb54F', event: 'CollectionDestroyed', returnValues: { collectionId: '0x17c4e6453cc49AaAAEAca894E6d9683E00000184' } } } to deeply equal [ { address: '0x6C4E9fE1AE37a41E93CEE429e8E1881aBdcbb54F', event: 'CollectionDestroyed', args: { collectionId: '0x17c4e6453cc49AaAAEAca894E6d9683E00000184' } } ]
|
yarn-dev / opal
Process completed with exit code 1.
|
(!negative tests!) Create NFT collection from EVM ► (!negative tests!) Create NFT collection from EVM ► destroyCollection:
js-packages/tests/mochawesome-report/test-1740389419.json#L0
Failed test found in:
js-packages/tests/mochawesome-report/test-1740389419.json
Error:
AssertionError: expected { CollectionDestroyed: { address: '0x6C4E9fE1AE37a41E93CEE429e8E1881aBdcbb54F', event: 'CollectionDestroyed', returnValues: { collectionId: '0x17C4e6453cC49AaAaEaca894e6D9683e0000018F' } } } to deeply equal [ { address: '0x6C4E9fE1AE37a41E93CEE429e8E1881aBdcbb54F', event: 'CollectionDestroyed', args: { collectionId: '0x17C4e6453cC49AaAaEaca894e6D9683e0000018F' } } ]
|
[FT] Sync sub & eth events ► [FT] Sync sub & eth events ► CollectionCreated and CollectionDestroyed events:
js-packages/tests/mochawesome-report/test-1740389419.json#L0
Failed test found in:
js-packages/tests/mochawesome-report/test-1740389419.json
Error:
AssertionError: expected { CollectionCreated: { address: '0x6C4E9fE1AE37a41E93CEE429e8E1881aBdcbb54F', event: 'CollectionCreated', returnValues: { owner: '0x702668753982F9CF4575A1464Dd3C5Fe3b260484', collectionId: '0x17c4e6453cC49AAaaEacA894e6D9683e000001a0' } } } to contain subset [ { event: 'CollectionCreated', args: { owner: '0x702668753982F9CF4575A1464Dd3C5Fe3b260484', collectionId: '0x17c4e6453cC49AAaaEacA894e6D9683e000001a0' } } ]
|
[NFT] Sync sub & eth events ► [NFT] Sync sub & eth events ► CollectionChanged event for TokenPropertySet, TokenPropertyDeleted:
js-packages/tests/mochawesome-report/test-1740389419.json#L0
Failed test found in:
js-packages/tests/mochawesome-report/test-1740389419.json
Error:
AssertionError: expected undefined to be like { event: 'TokenChanged', returnValues: { tokenId: '1' } }
|
[NFT] Sync sub & eth events ► [NFT] Sync sub & eth events ► CollectionCreated and CollectionDestroyed events:
js-packages/tests/mochawesome-report/test-1740389419.json#L0
Failed test found in:
js-packages/tests/mochawesome-report/test-1740389419.json
Error:
AssertionError: expected { CollectionCreated: { address: '0x6C4E9fE1AE37a41E93CEE429e8E1881aBdcbb54F', event: 'CollectionCreated', returnValues: { owner: '0xBaC96b505a6a712b265D8c4D8b98dcbA29135a01', collectionId: '0x17c4e6453cc49aaaaEaca894e6d9683E000001a8' } } } to contain subset [ { event: 'CollectionCreated', args: { owner: '0xBaC96b505a6a712b265D8c4D8b98dcbA29135a01', collectionId: '0x17c4e6453cc49aaaaEaca894e6d9683E000001a8' } } ]
|
[RFT] Sync sub & eth events ► [RFT] Sync sub & eth events ► CollectionChanged event for TokenPropertySet, TokenPropertyDeleted:
js-packages/tests/mochawesome-report/test-1740389419.json#L0
Failed test found in:
js-packages/tests/mochawesome-report/test-1740389419.json
Error:
AssertionError: expected undefined to be like { event: 'TokenChanged', returnValues: { tokenId: '1' } }
|
[RFT] Sync sub & eth events ► [RFT] Sync sub & eth events ► CollectionCreated and CollectionDestroyed events:
js-packages/tests/mochawesome-report/test-1740389419.json#L0
Failed test found in:
js-packages/tests/mochawesome-report/test-1740389419.json
Error:
AssertionError: expected { CollectionCreated: { address: '0x6C4E9fE1AE37a41E93CEE429e8E1881aBdcbb54F', event: 'CollectionCreated', returnValues: { owner: '0x63361a30EA4E43788d06f8818BF46Af3F58Ccb29', collectionId: '0x17c4e6453CC49AAAAEAca894E6d9683E000001B2' } } } to contain subset [ { event: 'CollectionCreated', args: { owner: '0x63361a30EA4E43788d06f8818BF46Af3F58Ccb29', collectionId: '0x17c4e6453CC49AAAAEAca894E6d9683E000001B2' } } ]
|
Create collection from EVM ► Create collection from EVM Fungible collection ► destroyCollection:
js-packages/tests/mochawesome-report/test-1740389419.json#L0
Failed test found in:
js-packages/tests/mochawesome-report/test-1740389419.json
Error:
AssertionError: expected { CollectionDestroyed: { address: '0x6C4E9fE1AE37a41E93CEE429e8E1881aBdcbb54F', event: 'CollectionDestroyed', returnValues: { collectionId: '0x17C4E6453cc49aAAaeaca894E6D9683e00000145' } } } to deeply equal [ { address: '0x6C4E9fE1AE37a41E93CEE429e8E1881aBdcbb54F', event: 'CollectionDestroyed', args: { collectionId: '0x17C4E6453cc49aAAaeaca894E6D9683e00000145' } } ]
|
Create collection from EVM ► Create collection from EVM Nonfungible collection ► Create collection:
js-packages/tests/mochawesome-report/test-1740389419.json#L0
Failed test found in:
js-packages/tests/mochawesome-report/test-1740389419.json
Error:
AssertionError: expected { CollectionCreated: { address: '0x6C4E9fE1AE37a41E93CEE429e8E1881aBdcbb54F', event: 'CollectionCreated', returnValues: { owner: '0x1bacF0948a0047f19D7e492F5c4A375FDB1fCd47', collectionId: '0x17C4E6453cc49AAAaEAcA894E6d9683E00000146' } } } to deeply equal [ { address: '0x6C4E9fE1AE37a41E93CEE429e8E1881aBdcbb54F', event: 'CollectionCreated', args: { owner: '0x1bacF0948a0047f19D7e492F5c4A375FDB1fCd47', collectionId: '0x17C4E6453cc49AAAaEAcA894E6d9683E00000146' } } ]
|
Create collection from EVM ► Create collection from EVM Sponsoring ► Can sponsor from evm address via access list:
js-packages/tests/mochawesome-report/test-1740389419.json#L0
Failed test found in:
js-packages/tests/mochawesome-report/test-1740389419.json
Error:
TypeError: result.events.normalized.find is not a function
|
Create collection from EVM ► Create collection from EVM Sponsoring ► Check that transaction via EVM spend money from sponsor address:
js-packages/tests/mochawesome-report/test-1740389419.json#L0
Failed test found in:
js-packages/tests/mochawesome-report/test-1740389419.json
Error:
TypeError: mintingResult.events.normalized.find is not a function
|
Create FT collection from EVM ► Create FT collection from EVM ► destroyCollection:
js-packages/tests/mochawesome-report/test-1740389419.json#L0
Failed test found in:
js-packages/tests/mochawesome-report/test-1740389419.json
Error:
AssertionError: expected { CollectionDestroyed: { address: '0x6C4E9fE1AE37a41E93CEE429e8E1881aBdcbb54F', event: 'CollectionDestroyed', returnValues: { collectionId: '0x17c4e6453cc49AaAAEAca894E6d9683E00000184' } } } to deeply equal [ { address: '0x6C4E9fE1AE37a41E93CEE429e8E1881aBdcbb54F', event: 'CollectionDestroyed', args: { collectionId: '0x17c4e6453cc49AaAAEAca894E6d9683E00000184' } } ]
|
yarn-dev / unique
Process completed with exit code 1.
|
(!negative tests!) Create NFT collection from EVM ► (!negative tests!) Create NFT collection from EVM ► destroyCollection:
js-packages/tests/mochawesome-report/test-1740389669.json#L0
Failed test found in:
js-packages/tests/mochawesome-report/test-1740389669.json
Error:
AssertionError: expected { CollectionDestroyed: { address: '0x6C4E9fE1AE37a41E93CEE429e8E1881aBdcbb54F', event: 'CollectionDestroyed', returnValues: { collectionId: '0x17C4e6453cC49AaAaEaca894e6D9683e0000018F' } } } to deeply equal [ { address: '0x6C4E9fE1AE37a41E93CEE429e8E1881aBdcbb54F', event: 'CollectionDestroyed', args: { collectionId: '0x17C4e6453cC49AaAaEaca894e6D9683e0000018F' } } ]
|
[FT] Sync sub & eth events ► [FT] Sync sub & eth events ► CollectionCreated and CollectionDestroyed events:
js-packages/tests/mochawesome-report/test-1740389669.json#L0
Failed test found in:
js-packages/tests/mochawesome-report/test-1740389669.json
Error:
AssertionError: expected { CollectionCreated: { address: '0x6C4E9fE1AE37a41E93CEE429e8E1881aBdcbb54F', event: 'CollectionCreated', returnValues: { owner: '0x1Bd5bFB8Abc19eceC18a6871A934B355e889CE56', collectionId: '0x17c4e6453cC49AAaaEacA894e6D9683e000001a0' } } } to contain subset [ { event: 'CollectionCreated', args: { owner: '0x1Bd5bFB8Abc19eceC18a6871A934B355e889CE56', collectionId: '0x17c4e6453cC49AAaaEacA894e6D9683e000001a0' } } ]
|
[NFT] Sync sub & eth events ► [NFT] Sync sub & eth events ► CollectionChanged event for TokenPropertySet, TokenPropertyDeleted:
js-packages/tests/mochawesome-report/test-1740389669.json#L0
Failed test found in:
js-packages/tests/mochawesome-report/test-1740389669.json
Error:
AssertionError: expected undefined to be like { event: 'TokenChanged', returnValues: { tokenId: '1' } }
|
[NFT] Sync sub & eth events ► [NFT] Sync sub & eth events ► CollectionCreated and CollectionDestroyed events:
js-packages/tests/mochawesome-report/test-1740389669.json#L0
Failed test found in:
js-packages/tests/mochawesome-report/test-1740389669.json
Error:
AssertionError: expected { CollectionCreated: { address: '0x6C4E9fE1AE37a41E93CEE429e8E1881aBdcbb54F', event: 'CollectionCreated', returnValues: { owner: '0x9e9c1a03e0dA172456DDbCF3d5175C6A5d111BD8', collectionId: '0x17c4e6453cc49aaaaEaca894e6d9683E000001a8' } } } to contain subset [ { event: 'CollectionCreated', args: { owner: '0x9e9c1a03e0dA172456DDbCF3d5175C6A5d111BD8', collectionId: '0x17c4e6453cc49aaaaEaca894e6d9683E000001a8' } } ]
|
[RFT] Sync sub & eth events ► [RFT] Sync sub & eth events ► CollectionChanged event for TokenPropertySet, TokenPropertyDeleted:
js-packages/tests/mochawesome-report/test-1740389669.json#L0
Failed test found in:
js-packages/tests/mochawesome-report/test-1740389669.json
Error:
AssertionError: expected undefined to be like { event: 'TokenChanged', returnValues: { tokenId: '1' } }
|
[RFT] Sync sub & eth events ► [RFT] Sync sub & eth events ► CollectionCreated and CollectionDestroyed events:
js-packages/tests/mochawesome-report/test-1740389669.json#L0
Failed test found in:
js-packages/tests/mochawesome-report/test-1740389669.json
Error:
AssertionError: expected { CollectionCreated: { address: '0x6C4E9fE1AE37a41E93CEE429e8E1881aBdcbb54F', event: 'CollectionCreated', returnValues: { owner: '0xF5F43A0730D49eBc2C3eB61a7bDF0403a2f3F2eC', collectionId: '0x17c4e6453CC49AAAAEAca894E6d9683E000001B2' } } } to contain subset [ { event: 'CollectionCreated', args: { owner: '0xF5F43A0730D49eBc2C3eB61a7bDF0403a2f3F2eC', collectionId: '0x17c4e6453CC49AAAAEAca894E6d9683E000001B2' } } ]
|
Create collection from EVM ► Create collection from EVM Fungible collection ► destroyCollection:
js-packages/tests/mochawesome-report/test-1740389669.json#L0
Failed test found in:
js-packages/tests/mochawesome-report/test-1740389669.json
Error:
AssertionError: expected { CollectionDestroyed: { address: '0x6C4E9fE1AE37a41E93CEE429e8E1881aBdcbb54F', event: 'CollectionDestroyed', returnValues: { collectionId: '0x17C4E6453cc49aAAaeaca894E6D9683e00000145' } } } to deeply equal [ { address: '0x6C4E9fE1AE37a41E93CEE429e8E1881aBdcbb54F', event: 'CollectionDestroyed', args: { collectionId: '0x17C4E6453cc49aAAaeaca894E6D9683e00000145' } } ]
|
Create collection from EVM ► Create collection from EVM Nonfungible collection ► Create collection:
js-packages/tests/mochawesome-report/test-1740389669.json#L0
Failed test found in:
js-packages/tests/mochawesome-report/test-1740389669.json
Error:
AssertionError: expected { CollectionCreated: { address: '0x6C4E9fE1AE37a41E93CEE429e8E1881aBdcbb54F', event: 'CollectionCreated', returnValues: { owner: '0xe8dc5f6a792b82399AfB845326ea411d71929a52', collectionId: '0x17C4E6453cc49AAAaEAcA894E6d9683E00000146' } } } to deeply equal [ { address: '0x6C4E9fE1AE37a41E93CEE429e8E1881aBdcbb54F', event: 'CollectionCreated', args: { owner: '0xe8dc5f6a792b82399AfB845326ea411d71929a52', collectionId: '0x17C4E6453cc49AAAaEAcA894E6d9683E00000146' } } ]
|
Create collection from EVM ► Create collection from EVM Sponsoring ► Can sponsor from evm address via access list:
js-packages/tests/mochawesome-report/test-1740389669.json#L0
Failed test found in:
js-packages/tests/mochawesome-report/test-1740389669.json
Error:
TypeError: result.events.normalized.find is not a function
|
Create collection from EVM ► Create collection from EVM Sponsoring ► Check that transaction via EVM spend money from sponsor address:
js-packages/tests/mochawesome-report/test-1740389669.json#L0
Failed test found in:
js-packages/tests/mochawesome-report/test-1740389669.json
Error:
TypeError: mintingResult.events.normalized.find is not a function
|
Create FT collection from EVM ► Create FT collection from EVM ► destroyCollection:
js-packages/tests/mochawesome-report/test-1740389669.json#L0
Failed test found in:
js-packages/tests/mochawesome-report/test-1740389669.json
Error:
AssertionError: expected { CollectionDestroyed: { address: '0x6C4E9fE1AE37a41E93CEE429e8E1881aBdcbb54F', event: 'CollectionDestroyed', returnValues: { collectionId: '0x17c4e6453cc49AaAAEAca894E6d9683E00000184' } } } to deeply equal [ { address: '0x6C4E9fE1AE37a41E93CEE429e8E1881aBdcbb54F', event: 'CollectionDestroyed', args: { collectionId: '0x17c4e6453cc49AaAAEAca894E6d9683E00000184' } } ]
|
yarn-dev / quartz
Process completed with exit code 1.
|
Create NFT collection from EVM ► Create NFT collection from EVM ► Create collection:
js-packages/tests/mochawesome-report/test-sequential-1740413066.json#L0
Failed test found in:
js-packages/tests/mochawesome-report/test-sequential-1740413066.json
Error:
AssertionError: expected { CollectionCreated: { address: '0x6C4E9fE1AE37a41E93CEE429e8E1881aBdcbb54F', event: 'CollectionCreated', returnValues: { owner: '0xD31E0828202Da361e2F3511d52EE8fD6dFd88262', collectionId: '0x17c4e6453cC49aaaaeaCa894e6D9683e00001877' } } } to deeply equal [ { address: '0x6C4E9fE1AE37a41E93CEE429e8E1881aBdcbb54F', event: 'CollectionCreated', args: { owner: '0xD31E0828202Da361e2F3511d52EE8fD6dFd88262', collectionId: '0x17c4e6453cC49aaaaeaCa894e6D9683e00001877' } } ]
|
main-process / opal-update
No test report files were found
|
main-process / opal-update
Process completed with exit code 1.
|
main-process / opal-update
Process completed with exit code 1.
|
Create NFT collection from EVM ► Create NFT collection from EVM ► Create collection:
js-packages/tests/mochawesome-report/test-sequential-1740415282.json#L0
Failed test found in:
js-packages/tests/mochawesome-report/test-sequential-1740415282.json
Error:
AssertionError: expected { CollectionCreated: { address: '0x6C4E9fE1AE37a41E93CEE429e8E1881aBdcbb54F', event: 'CollectionCreated', returnValues: { owner: '0xFef7DEb71b2C830CB86E5b179D3EC2c3B580aF57', collectionId: '0x17c4e6453Cc49AaAAEAca894e6D9683E0000076C' } } } to deeply equal [ { address: '0x6C4E9fE1AE37a41E93CEE429e8E1881aBdcbb54F', event: 'CollectionCreated', args: { owner: '0xFef7DEb71b2C830CB86E5b179D3EC2c3B580aF57', collectionId: '0x17c4e6453Cc49AaAAEAca894e6D9683E0000076C' } } ]
|
main-process / quartz-update
Process completed with exit code 1.
|
main-process / quartz-update
No test report files were found
|
main-process / quartz-update
Process completed with exit code 1.
|
Create NFT collection from EVM ► Create NFT collection from EVM ► Create collection:
js-packages/tests/mochawesome-report/test-sequential-1740435994.json#L0
Failed test found in:
js-packages/tests/mochawesome-report/test-sequential-1740435994.json
Error:
AssertionError: expected { CollectionCreated: { address: '0x6C4E9fE1AE37a41E93CEE429e8E1881aBdcbb54F', event: 'CollectionCreated', returnValues: { owner: '0xA5Eb185e348b5ecc99d87E410Ac66Dc1d557BAF4', collectionId: '0x17C4E6453cC49AAaAEAca894e6d9683E000007Df' } } } to deeply equal [ { address: '0x6C4E9fE1AE37a41E93CEE429e8E1881aBdcbb54F', event: 'CollectionCreated', args: { owner: '0xA5Eb185e348b5ecc99d87E410Ac66Dc1d557BAF4', collectionId: '0x17C4E6453cC49AAaAEAca894e6d9683E000007Df' } } ]
|
main-process / unique-update
Process completed with exit code 1.
|
main-process / unique-update
No test report files were found
|
main-process / unique-update
Process completed with exit code 1.
|
codestyle / yarn_eslint:
js-packages/playgrounds/unique.ts#L196
toHuman results in horrible, hard to debug conversions with no stability guarantees, use Codec/at least .toJson instead
|
codestyle / yarn_eslint:
js-packages/playgrounds/unique.ts#L230
toHuman results in horrible, hard to debug conversions with no stability guarantees, use Codec/at least .toJson instead
|
codestyle / yarn_eslint:
js-packages/playgrounds/unique.ts#L254
toHuman results in horrible, hard to debug conversions with no stability guarantees, use Codec/at least .toJson instead
|
codestyle / yarn_eslint:
js-packages/playgrounds/unique.ts#L289
toHuman results in horrible, hard to debug conversions with no stability guarantees, use Codec/at least .toJson instead
|
codestyle / yarn_eslint:
js-packages/playgrounds/unique.ts#L290
toHuman results in horrible, hard to debug conversions with no stability guarantees, use Codec/at least .toJson instead
|
codestyle / yarn_eslint:
js-packages/playgrounds/unique.ts#L337
toHuman results in horrible, hard to debug conversions with no stability guarantees, use Codec/at least .toJson instead
|
codestyle / yarn_eslint:
js-packages/playgrounds/unique.ts#L337
toHuman results in horrible, hard to debug conversions with no stability guarantees, use Codec/at least .toJson instead
|
codestyle / yarn_eslint:
js-packages/playgrounds/unique.ts#L341
toHuman results in horrible, hard to debug conversions with no stability guarantees, use Codec/at least .toJson instead
|
codestyle / yarn_eslint:
js-packages/playgrounds/unique.ts#L345
toHuman results in horrible, hard to debug conversions with no stability guarantees, use Codec/at least .toJson instead
|
codestyle / yarn_eslint:
js-packages/playgrounds/unique.ts#L399
Variable name `InvalidTypeSymbol` must match one of the following formats: camelCase, UPPER_CASE
|
main-process / opal-update
No file matches path js-packages/tests/mochawesome-report/test-parallel-*.json
|
main-process / quartz-update
No file matches path js-packages/tests/mochawesome-report/test-parallel-*.json
|
main-process / unique-update
No file matches path js-packages/tests/mochawesome-report/test-parallel-*.json
|
Artifacts
Produced during runtime
Name | Size | |
---|---|---|
opal-main-baedeker-logs
|
5.98 MB |
|
quartz-main-baedeker-logs
|
6.08 MB |
|
unique-main-baedeker-logs
|
6.12 MB |
|