Unique Chain 1.14 #2709
1109 passed, 49 failed and 12 skipped
❌ js-packages/tests/mochawesome-report/test-1740389419.json
1170 tests were completed in 20706s with 1109 passed, 49 failed and 12 skipped.
Test suite | Passed | Failed | Skipped | Time |
---|---|---|---|---|
(!negative test!) integration test: ext. confirmSponsorship(): | 7✔️ | 16s | ||
(!negative test!) integration test: ext. createCollection(): | 6✔️ | 1s | ||
(!negative test!) integration test: ext. destroyCollection(): | 6✔️ | 10s | ||
(!negative test!) integration test: ext. removeCollectionSponsor(): | 5✔️ | 14s | ||
(!negative test!) integration test: ext. setCollectionSponsor(): | 3✔️ | 4s | ||
(!negative tests!) Create FT collection from EVM | 4✔️ | 31s | ||
(!negative tests!) Create NFT collection from EVM | 4✔️ | 1❌ | 56s | |
(!negative tests!) Create RFT collection from EVM | 5✔️ | 44s | ||
[approveToken] Approved amount decreases by the transferred amount: | 1✔️ | 5s | ||
[approveToken] Approved users can transferFrom up to approved amount: | 3✔️ | 13s | ||
[approveToken] Approved users cannot use transferFrom to repeat transfers if approved amount was already transferred: | 3✔️ | 13s | ||
[approveToken] Integration Test approve(spender, collection_id, item_id, amount) with collection admin permissions: | 1✔️ | 3s | ||
[approveToken] Negative Integration Test approve(spender, collection_id, item_id, amount): | 14✔️ | 29s | ||
[approveToken] Normal user can approve other users to transfer: | 3✔️ | 10s | ||
[approveToken] User cannot approve for the amount greater than they own: | 3✔️ | 7s | ||
[approveToken] User may clear the approvals to approving for 0 amount: | 3✔️ | 13s | ||
[approveTokenFromEth] Approved amount decreases by the transferred amount: | 1✔️ | 5s | ||
[approveTokenFromEth] Approved users can transferFrom up to approved amount: | 3✔️ | 13s | ||
[approveTokenFromEth] Approved users cannot use transferFrom to repeat transfers if approved amount was already transferred: | 3✔️ | 13s | ||
[approveTokenFromEth] Integration Test approve(spender, collection_id, item_id, amount) with collection admin permissions: | 1✔️ | 3s | ||
[approveTokenFromEth] Negative Integration Test approve(spender, collection_id, item_id, amount): | 14✔️ | 29s | ||
[approveTokenFromEth] Normal user can approve other users to transfer: | 3✔️ | 10s | ||
[approveTokenFromEth] User cannot approve for the amount greater than they own: | 3✔️ | 7s | ||
[approveTokenFromEth] User may clear the approvals to approving for 0 amount: | 3✔️ | 13s | ||
[eth]CollectionHelperAddress test: ERC20/ERC721 | 4✔️ | 41s | ||
[FT] Sync sub & eth events | 7✔️ | 1❌ | 401s | |
[NFT] Sync sub & eth events | 8✔️ | 2❌ | 495s | |
[RFT] Sync sub & eth events | 8✔️ | 2❌ | 495s | |
Add collection admins | 10✔️ | 360s | ||
Administrator and collection owner do not need approval in order to execute TransferFrom (with owner_can_transfer_flag = true): | 3✔️ | 19s | ||
App promotion | 53✔️ | 482s | ||
Burn Item event | 1✔️ | 3s | ||
Can set collection limits | 3✔️ | 365s | ||
Cannot set invalid collection limits | 6✔️ | 85s | ||
Change owner tests | 3✔️ | 68s | ||
Change substrate owner tests | 2✔️ | 55s | ||
Check ERC721 token URI for NFT | 4✔️ | 174s | ||
Check ERC721 token URI for ReFungible | 4✔️ | 174s | ||
Collection zero limits (Fungible) | 1✔️ | 8s | ||
Collection zero limits (NFT) | 1✔️ | 8s | ||
Collection zero limits (ReFungible) | 1✔️ | 8s | ||
Common metadata | 4✔️ | 7s | ||
Common nesting tests | 9✔️ | 69s | ||
Composite nesting tests | 2✔️ | 24s | ||
Connection smoke test | 2✔️ | 134ms | ||
Contract calls | 3✔️ | 33s | ||
Create collection event | 1✔️ | 2s | ||
Create collection from EVM | 44✔️ | 4❌ | 1388s | |
Create FT collection from EVM | 5✔️ | 1❌ | 142s | |
Create Item event | 1✔️ | 3s | ||
Create Multiple Items Event event | 1✔️ | 3s | ||
Create NFT collection from EVM | 4✔️ | 2❌ | 130s | |
Create RFT collection from EVM | 5✔️ | 129s | ||
Destroy collection event | 1✔️ | 3s | ||
Destroy Collection from EVM | 3✔️ | 43s | ||
Effective collection limits (NFT) | 1✔️ | 3s | ||
Enable/Disable Transfers | 2✔️ | 6s | ||
ERC 1633 implementation | 1✔️ | 25s | ||
ERC-721 call methods | 10✔️ | 366s | ||
ERC165 tests | 6✔️ | 775ms | ||
Eth fees are correct | 1✔️ | 19s | ||
Ethereum native RPC calls | 1✔️ | 1s | ||
Evm Coder tests | 1✔️ | 38s | ||
EVM collection allowlist | 10✔️ | 681s | ||
EVM collection properties | 12✔️ | 135s | ||
EVM contract allowlist | 2✔️ | 76s | ||
EVM Migrations | 4✔️ | 10s | ||
EVM nesting tests group | 14✔️ | 1045s | ||
evm nft collection sponsoring | 3✔️ | 6❌ | 663s | |
EVM payable contracts | 5✔️ | 136s | ||
evm RFT collection sponsoring | 7✔️ | 8❌ | 1053s | |
evm RFT token sponsoring | 6✔️ | 604s | ||
EVM sponsoring | 2✔️ | 175s | ||
EVM token properties | 13✔️ | 815s | ||
EVM token properties negative | 20✔️ | 258s | ||
EVM transaction fees | 7✔️ | 73s | ||
Fractionalizer contract usage | 1✔️ | 5❌ | 346s | |
FT: ERC-20 call methods | 3✔️ | 64s | ||
Fungible (Via EVM proxy): Information getting | 2✔️ | 9s | ||
Fungible (Via EVM proxy): Plain calls | 3❌ | 64s | ||
Fungible negative tests | 1✔️ | 5s | ||
Fungible: Fees | 3✔️ | 61s | ||
Fungible: Plain calls | 13✔️ | 2❌ | 292s | |
Fungible: Substrate calls | 3✔️ | 1❌ | 28s | |
Graphs | 1✔️ | 12s | ||
Helpers sanity check | 2✔️ | 15s | ||
Integration Test addCollectionAdmin(collection_id, new_admin_id): | 1✔️ | 3s | ||
Integration Test approveToken(spender, collection_id, item_id, amount): | 7✔️ | 25s | ||
Integration Test approveTokenFromEth(spender, collection_id, item_id, amount): | 7✔️ | 25s | ||
Integration Test changeCollectionOwner(collection_id, new_owner) special checks for exOwner: | 3✔️ | 14s | ||
Integration Test changeCollectionOwner(collection_id, new_owner): | 1✔️ | 2s | ||
Integration Test createMultipleItems(collection_id, owner, items_data): | 7✔️ | 16s | ||
Integration Test ext. Allow list tests | 6✔️ | 13s | ||
Integration Test ext. Mint if included in Allow List | 3✔️ | 10s | ||
Integration Test ext. Remove from Allow List | 6✔️ | 18s | ||
Integration Test ext. Transfer if included in Allow List | 10✔️ | 59s | ||
Integration Test getNextSponsored(collection_id, owner, item_id): | 3✔️ | 16s | ||
Integration Test removeCollectionAdmin(collection_id, account_id): | 2✔️ | 5s | ||
Integration Test Transfer(recipient, collection_id, item_id, value) | 8✔️ | 24s | ||
Integration Test transferFrom(from, recipient, collection_id, item_id, value): | 5✔️ | 22s | ||
Integration Test: Access Rights to Token Properties | 5✔️ | 16s | ||
integration test: API UNIQUE consts | 15✔️ | 2s | ||
Integration Test: Collator Selection | 5✖️ | 0ms | ||
Integration Test: Collection Properties | 22✔️ | 118s | ||
Integration Test: Collection Properties with sudo | 3✔️ | 10s | ||
Integration Test: createMultipleItemsEx | 7✔️ | 16s | ||
integration test: ext. (): | 13✔️ | 36s | ||
integration test: ext. burnItem() with admin permissions: | 2✔️ | 11s | ||
integration test: ext. burnItem(): | 2✔️ | 7s | ||
integration test: ext. confirmSponsorship(): | 11✔️ | 58s | ||
integration test: ext. createCollection(): | 11✔️ | 15s | ||
integration test: ext. destroyCollection(): | 3✔️ | 7s | ||
integration test: ext. removeCollectionSponsor(): | 5✔️ | 21s | ||
integration test: ext. setCollectionSponsor(): | 6✔️ | 17s | ||
integration test: Fees must be credited to Treasury: | 7✔️ | 14s | ||
integration test: Fungible functionality: | 7✔️ | 35s | ||
Integration Test: Identities Manipulation | 7✖️ | 0ms | ||
integration test: Inflation | 2✔️ | 2s | ||
Integration Test: Maintenance Functionality | 6✔️ | 56s | ||
Integration Test: ownerCanTransfer allows admins to use only transferFrom/burnFrom: | 2✔️ | 9s | ||
integration test: Refungible functionality: | 9✔️ | 39s | ||
integration test: RPC methods | 2✔️ | 14s | ||
Integration Test: Set Permissions | 3✔️ | 11s | ||
Integration Test: Token Properties | 18✔️ | 217s | ||
Integration Test: Token Properties with sudo | 2✔️ | 9s | ||
Integration Test: Unnesting | 16✔️ | 137s | ||
Market V2 Contract | 2✔️ | 227s | ||
Matcher contract usage | 3✔️ | 204s | ||
Minting tokens | 11✔️ | 273s | ||
Native fungible | 27✔️ | 13s | ||
NativeFungible: ERC20 calls | 8✔️ | 36s | ||
NativeFungible: ERC20UniqueExtensions calls | 2✔️ | 29s | ||
Negative Enable/Disable Transfers | 1✔️ | 1s | ||
Negative Integration Test addCollectionAdmin(collection_id, new_admin_id): | 5✔️ | 21s | ||
Negative Integration Test changeCollectionOwner(collection_id, new_owner): | 4✔️ | 7s | ||
Negative Integration Test createMultipleItems(collection_id, owner, items_data): | 12✔️ | 14s | ||
Negative Integration Test removeCollectionAdmin(collection_id, account_id): | 4✔️ | 8s | ||
Negative Integration Test Transfer(recipient, collection_id, item_id, value) | 16✔️ | 42s | ||
Negative Integration Test transferFrom(from, recipient, collection_id, item_id, value): | 18✔️ | 63s | ||
Negative Integration Test: Access Rights to Token Properties | 8✔️ | 15s | ||
Negative Integration Test: Collection Properties | 15✔️ | 24s | ||
Negative integration test: ext. burnItem(): | 6✔️ | 23s | ||
Negative integration test: ext. createItem(): | 11✔️ | 14s | ||
Negative Integration Test: Set Permissions | 3✔️ | 4s | ||
Negative Integration Test: Token Properties | 14✔️ | 240s | ||
Negative Integration Tests for fractionalizer | 15✔️ | 597s | ||
negative properties | 4✔️ | 9s | ||
Negative test: createMultipleItemsEx | 5✔️ | 6s | ||
Negative Test: Nesting | 15✔️ | 101s | ||
Negative Test: Unnesting | 7✔️ | 33s | ||
Negative tests | 5✔️ | 133s | ||
Nesting by collection admin | 3✔️ | 32s | ||
NFT (Via EVM proxy): Information getting | 3✔️ | 13s | ||
NFT (Via EVM proxy): Plain calls | 6❌ | 182s | ||
NFT: Fees | 4✔️ | 77s | ||
NFT: Plain calls | 21✔️ | 576s | ||
NFT: Substrate calls | 5✔️ | 17s | ||
Normal user can approve other users to be wallet operator: | 2✔️ | 7s | ||
Number of tokens per address (NFT) | 2✔️ | 14s | ||
Number of tokens per address (ReFungible) | 2✔️ | 14s | ||
Pallet presence | 3✔️ | 336ms | ||
Performace tests | 1✔️ | 278s | ||
Precompiles | 2✔️ | 3s | ||
query properties RPC | 9✔️ | 14s | ||
Refungible nesting | 4✔️ | 41s | ||
Refungible nesting negative tests | 2✔️ | 18s | ||
ReFungible token properties permissions tests | 4✔️ | 27s | ||
Refungible transfer tests | 2✔️ | 8s | ||
ReFungible-specific nesting tests | 1✔️ | 9s | ||
Refungible: burn | 4✔️ | 18s | ||
Refungible: burn negative tests | 1✔️ | 7s | ||
Refungible: Fees | 3✔️ | 61s | ||
Refungible: Plain calls | 36✔️ | 1237s | ||
Refungible: Substrate calls | 3✔️ | 12s | ||
Remove collection admins | 6✔️ | 235s | ||
RFT: ERC-20 call methods | 3✔️ | 100s | ||
RFT: Fees | 2✔️ | 76s | ||
RPC eth_getCode | 5✔️ | 5s | ||
Send value to contract | 1✔️ | 5s | ||
setCollectionLimits negative | 5✔️ | 8s | ||
setCollectionLimits positive | 3✔️ | 9s | ||
Sponsoring EVM contracts | 14✔️ | 5❌ | 690s | |
Sponsoring Fee Limit | 5✔️ | 146s | ||
Supports ERC721Metadata | 2✔️ | 245s | ||
Token transfer between substrate address and EVM address. Fungible | 2✔️ | 26s | ||
Token transfer between substrate address and EVM address. NFT | 2✔️ | 27s | ||
Transfer event | 2✔️ | 7s | ||
Transfers to self (potentially over substrate-evm boundary) | 4✔️ | 20s | ||
TxVersion is present | 1✔️ | 130ms | ||
Vesting | 3✔️ | 19s |
❌ (!negative tests!) Create NFT collection from EVM
(!negative tests!) Create NFT collection from EVM
❌ destroyCollection
AssertionError: expected { CollectionDestroyed: { address: '0x6C4E9fE1AE37a41E93CEE429e8E1881aBdcbb54F', event: 'CollectionDestroyed', returnValues: { collectionId: '0x17C4e6453cC49AaAaEaca894e6D9683e0000018F' } } } to deeply equal [ { address: '0x6C4E9fE1AE37a41E93CEE429e8E1881aBdcbb54F', event: 'CollectionDestroyed', args: { collectionId: '0x17C4e6453cC49AaAaEaca894e6D9683e0000018F' } } ]
❌ [FT] Sync sub & eth events
[FT] Sync sub & eth events
❌ CollectionCreated and CollectionDestroyed events
AssertionError: expected { CollectionCreated: { address: '0x6C4E9fE1AE37a41E93CEE429e8E1881aBdcbb54F', event: 'CollectionCreated', returnValues: { owner: '0x702668753982F9CF4575A1464Dd3C5Fe3b260484', collectionId: '0x17c4e6453cC49AAaaEacA894e6D9683e000001a0' } } } to contain subset [ { event: 'CollectionCreated', args: { owner: '0x702668753982F9CF4575A1464Dd3C5Fe3b260484', collectionId: '0x17c4e6453cC49AAaaEacA894e6D9683e000001a0' } } ]
❌ [NFT] Sync sub & eth events
[NFT] Sync sub & eth events
❌ CollectionChanged event for TokenPropertySet, TokenPropertyDeleted
AssertionError: expected undefined to be like { event: 'TokenChanged', returnValues: { tokenId: '1' } }
❌ CollectionCreated and CollectionDestroyed events
AssertionError: expected { CollectionCreated: { address: '0x6C4E9fE1AE37a41E93CEE429e8E1881aBdcbb54F', event: 'CollectionCreated', returnValues: { owner: '0xBaC96b505a6a712b265D8c4D8b98dcbA29135a01', collectionId: '0x17c4e6453cc49aaaaEaca894e6d9683E000001a8' } } } to contain subset [ { event: 'CollectionCreated', args: { owner: '0xBaC96b505a6a712b265D8c4D8b98dcbA29135a01', collectionId: '0x17c4e6453cc49aaaaEaca894e6d9683E000001a8' } } ]
❌ [RFT] Sync sub & eth events
[RFT] Sync sub & eth events
❌ CollectionChanged event for TokenPropertySet, TokenPropertyDeleted
AssertionError: expected undefined to be like { event: 'TokenChanged', returnValues: { tokenId: '1' } }
❌ CollectionCreated and CollectionDestroyed events
AssertionError: expected { CollectionCreated: { address: '0x6C4E9fE1AE37a41E93CEE429e8E1881aBdcbb54F', event: 'CollectionCreated', returnValues: { owner: '0x63361a30EA4E43788d06f8818BF46Af3F58Ccb29', collectionId: '0x17c4e6453CC49AAAAEAca894E6d9683E000001B2' } } } to contain subset [ { event: 'CollectionCreated', args: { owner: '0x63361a30EA4E43788d06f8818BF46Af3F58Ccb29', collectionId: '0x17c4e6453CC49AAAAEAca894E6d9683E000001B2' } } ]
❌ Create collection from EVM
Create collection from EVM Collection admins
Create collection from EVM Collection properties
Create collection from EVM Create RFT collection from EVM
Create collection from EVM Flags
Create collection from EVM Fungible collection
❌ destroyCollection
AssertionError: expected { CollectionDestroyed: { address: '0x6C4E9fE1AE37a41E93CEE429e8E1881aBdcbb54F', event: 'CollectionDestroyed', returnValues: { collectionId: '0x17C4E6453cc49aAAaeaca894E6D9683e00000145' } } } to deeply equal [ { address: '0x6C4E9fE1AE37a41E93CEE429e8E1881aBdcbb54F', event: 'CollectionDestroyed', args: { collectionId: '0x17C4E6453cc49aAAaeaca894E6D9683e00000145' } } ]
Create collection from EVM Nesting
Create collection from EVM Nonfungible collection
❌ Create collection
AssertionError: expected { CollectionCreated: { address: '0x6C4E9fE1AE37a41E93CEE429e8E1881aBdcbb54F', event: 'CollectionCreated', returnValues: { owner: '0x1bacF0948a0047f19D7e492F5c4A375FDB1fCd47', collectionId: '0x17C4E6453cc49AAAaEAcA894E6d9683E00000146' } } } to deeply equal [ { address: '0x6C4E9fE1AE37a41E93CEE429e8E1881aBdcbb54F', event: 'CollectionCreated', args: { owner: '0x1bacF0948a0047f19D7e492F5c4A375FDB1fCd47', collectionId: '0x17C4E6453cc49AAAaEAcA894E6d9683E00000146' } } ]
Create collection from EVM Sponsoring
❌ Can sponsor from evm address via access list
TypeError: result.events.normalized.find is not a function
❌ Check that transaction via EVM spend money from sponsor address
TypeError: mintingResult.events.normalized.find is not a function
Create collection from EVM Token property permissions
❌ Create FT collection from EVM
Create FT collection from EVM
❌ destroyCollection
AssertionError: expected { CollectionDestroyed: { address: '0x6C4E9fE1AE37a41E93CEE429e8E1881aBdcbb54F', event: 'CollectionDestroyed', returnValues: { collectionId: '0x17c4e6453cc49AaAAEAca894E6d9683E00000184' } } } to deeply equal [ { address: '0x6C4E9fE1AE37a41E93CEE429e8E1881aBdcbb54F', event: 'CollectionDestroyed', args: { collectionId: '0x17c4e6453cc49AaAAEAca894E6d9683E00000184' } } ]
❌ Create NFT collection from EVM
Create NFT collection from EVM
❌ Create collection
AssertionError: expected { CollectionCreated: { address: '0x6C4E9fE1AE37a41E93CEE429e8E1881aBdcbb54F', event: 'CollectionCreated', returnValues: { owner: '0xfDCaF699F55122c4b05d1646DA5724239F5da85e', collectionId: '0x17c4E6453CC49aAaAEAca894e6D9683E00000187' } } } to deeply equal [ { address: '0x6C4E9fE1AE37a41E93CEE429e8E1881aBdcbb54F', event: 'CollectionCreated', args: { owner: '0xfDCaF699F55122c4b05d1646DA5724239F5da85e', collectionId: '0x17c4E6453CC49aAaAEAca894e6D9683E00000187' } } ]
❌ Create collection with properties & get desctription
AssertionError: expected { CollectionCreated: { address: '0x6C4E9fE1AE37a41E93CEE429e8E1881aBdcbb54F', event: 'CollectionCreated', returnValues: { owner: '0xA1f16998c637D3AB0EEAB8BaA98F8AAd724d3902', collectionId: '0x17C4e6453cc49aaAaeaCa894E6D9683E00000189' } } } to deeply equal [ { address: '0x6C4E9fE1AE37a41E93CEE429e8E1881aBdcbb54F', event: 'CollectionCreated', args: { owner: '0xA1f16998c637D3AB0EEAB8BaA98F8AAd724d3902', collectionId: '0x17C4e6453cc49aaAaeaCa894E6D9683E00000189' } } ]
❌ evm nft collection sponsoring
evm nft collection sponsoring
❌ [setCollectionSponsor] Can sponsor from evm address via access list
TypeError: result.events.normalized.find is not a function
❌ [setCollectionSponsor] Check that transaction via EVM spend money from sponsor address
TypeError: mintingResult.events.normalized.find is not a function
❌ [setCollectionSponsorCross] Can sponsor from evm address via access list
TypeError: result.events.normalized.find is not a function
❌ [setCollectionSponsorCross] Check that transaction via EVM spend money from sponsor address
TypeError: mintingResult.events.normalized.find is not a function
❌ Can sponsor [set token properties] via access list
TypeError: result.events.normalized.find is not a function
❌ sponsors mint transactions
AssertionError: expected { Transfer: { address: '0x17c4E6453cC49aAAAeACA894e6D9683e00000126', event: 'Transfer', returnValues: { from: '0x0000000000000000000000000000000000000000', to: '0xd08c6EE1fabB1F9a59E170CcA5B107C9df28d0FF', tokenId: '1' } } } to deeply equal [ { address: '0x17c4E6453cC49aAAAeACA894e6D9683e00000126', event: 'Transfer', args: { from: '0x0000000000000000000000000000000000000000', to: '0xd08c6EE1fabB1F9a59E170CcA5B107C9df28d0FF', tokenId: '1' } } ]
❌ evm RFT collection sponsoring
evm RFT collection sponsoring
❌ [mintCross] sponsors mint transactions
AssertionError: expected { Transfer: { address: '0x17c4e6453Cc49aaaAEAcA894e6d9683E0000012f', event: 'Transfer', returnValues: { from: '0x0000000000000000000000000000000000000000', to: '0x78EAf5a6d2cB48d9e909DB053D7cF59496aA7Df5', tokenId: '1' } } } to have deep property 'address'
❌ [mintWithTokenURI] sponsors mint transactions
AssertionError: expected { Transfer: { address: '0x17C4E6453Cc49aAaAEaCa894e6D9683e00000130', event: 'Transfer', returnValues: { from: '0x0000000000000000000000000000000000000000', to: '0xED80F7A02077a77D6604e25039461e864Aa1c991', tokenId: '1' } } } to have deep property 'address'
❌ [setCollectionSponsor] Can sponsor from evm address via access list
AssertionError: expected { Transfer: { address: '0x17C4E6453CC49aaAAeaca894E6D9683E00000134', event: 'Transfer', returnValues: { from: '0x0000000000000000000000000000000000000000', to: '0x50e6161429b6F928ee042aFe778334027eCe5a04', tokenId: '1' } } } to have deep property 'address'
❌ [setCollectionSponsor] Check that collection admin EVM transaction spend money from sponsor eth address
AssertionError: expected { Transfer: { address: '0x17c4E6453cC49aaAAEAcA894e6d9683e00000136', event: 'Transfer', returnValues: { from: '0x0000000000000000000000000000000000000000', to: '0xDC7a77D669146975334a95D31FCfA40A4dce186F', tokenId: '1' } } } to have deep property 'address'
❌ [setCollectionSponsorCross] Can sponsor from evm address via access list
AssertionError: expected { Transfer: { address: '0x17c4e6453Cc49AaaAEACa894e6d9683E00000133', event: 'Transfer', returnValues: { from: '0x0000000000000000000000000000000000000000', to: '0xF52164A2AE30B18a110b6c462b69bbce7b960aF1', tokenId: '1' } } } to have deep property 'address'
❌ [setCollectionSponsorCross] Check that collection admin EVM transaction spend money from sponsor eth address
AssertionError: expected { Transfer: { address: '0x17c4E6453Cc49aAaAeacA894e6d9683e00000135', event: 'Transfer', returnValues: { from: '0x0000000000000000000000000000000000000000', to: '0xfB317394C527fA84b01dc3D18060253DABF07417', tokenId: '1' } } } to have deep property 'address'
❌ Check that collection admin EVM transaction spend money from sponsor sub address
AssertionError: expected { Transfer: { address: '0x17C4e6453Cc49AaAAeaCA894e6d9683e00000137', event: 'Transfer', returnValues: { from: '0x0000000000000000000000000000000000000000', to: '0xf9Bf169a2DD331Cf11A2F9E4aA68653d2e91FBee', tokenId: '1' } } } to have deep property 'address'
❌ Sponsoring collection from substrate address via access list
AssertionError: expected { Transfer: { address: '0x17c4e6453Cc49aaaAeaCa894E6D9683e00000138', event: 'Transfer', returnValues: { from: '0x0000000000000000000000000000000000000000', to: '0x48bE39D4d04D7F32E7Cb1015A818A92bfB66c6B0', tokenId: '1' } } } to have deep property 'address'
❌ Fractionalizer contract usage
Fractionalizer contract usage
❌ Mint RFT collection
AssertionError: expected <Anonymous Class>{ events: undefined } to be like { RFTCollectionSet: {} }
❌ NFT to RFT
AssertionError: expected <Anonymous Class>{ events: undefined } to be like { Fractionalized: { returnValues: { _collection: '0x17c4e6453CC49aaAAEaCa894e6D9683e000001c1', _tokenId: '1', _amount: '100' } } }
❌ RFT to NFT
AssertionError: expected <Anonymous Class>{ events: undefined } to be like { Defractionalized: { returnValues: { _rftToken: '0xf8238Ccfff8eD887463fD5E0000001C300000001', _nftCollection: '0x17C4E6453cc49aaaAEAcA894E6D9683e000001c4', _nftTokenId: '1' } } }
❌ Set Allowlist
AssertionError: expected <Anonymous Class>{ events: undefined } to be like { AllowListSet: { returnValues: { _collection: '0x17c4e6453cc49aAAAeACa894E6d9683e000001c0', _status: true } } }
❌ Set RFT collection
AssertionError: expected <Anonymous Class>{ events: undefined } to be like { RFTCollectionSet: { returnValues: { _collection: '0x17C4e6453CC49aaAAeaCA894E6d9683e000001BD' } } }
❌ Fungible (Via EVM proxy): Plain calls
Fungible (Via EVM proxy): Plain calls
❌ Can perform approve()
AssertionError: expected { Approval: { address: '0x17C4E6453cc49aAaAeAcA894E6d9683E0000023B', event: 'Approval', returnValues: { owner: '0x0315675bA1CcD2C1B875B7b256dDDD031E15D99b', spender: '0x76BC39a4D3F84b1dB47E71Ab014345B63AbC5843', value: '100' } } } to deeply equal [ { address: '0x17C4E6453cc49aAaAeAcA894E6d9683E0000023B', event: 'Approval', args: { owner: '0x0315675bA1CcD2C1B875B7b256dDDD031E15D99b', spender: '0x76BC39a4D3F84b1dB47E71Ab014345B63AbC5843', value: '100' } } ]
❌ Can perform transfer()
AssertionError: expected { Transfer: { address: '0x17c4e6453cC49aAaaEaCA894e6d9683E0000023d', event: 'Transfer', returnValues: { from: '0xF505515359FB8dbDD544Af2195dd7d0d0346cac5', to: '0x0c07df08d713aaa60a208D26638dF0bEf1650752', value: '50' } } } to deeply equal [ { address: '0x17c4e6453cC49aAaaEaCA894e6d9683E0000023d', event: 'Transfer', args: { from: '0xF505515359FB8dbDD544Af2195dd7d0d0346cac5', to: '0x0c07df08d713aaa60a208D26638dF0bEf1650752', value: '50' } } ]
❌ Can perform transferFrom()
AssertionError: expected { Transfer: { address: '0x17c4e6453cC49AaAAeaCA894E6D9683e0000023c', event: 'Transfer', returnValues: { from: '0x4880FcB99Ce12Ae0DEe2388f59d7fDd5ab2D2d01', to: '0x8D6e1B63f1f71daD29a324242e9f2d1599aFC174', value: '49' } }, Approval: { address: '0x17c4e6453cC49AaAAeaCA894E6D9683e0000023c', event: 'Approval', returnValues: { owner: '0x4880FcB99Ce12Ae0DEe2388f59d7fDd5ab2D2d01', spender: '0x6C9268b814f5Bc855da12a9DDeBF5fFaF2702284', value: '51' } } } to deeply equal [ { address: '0x17c4e6453cC49AaAAeaCA894E6D9683e0000023c', event: 'Transfer', args: { from: '0x4880FcB99Ce12Ae0DEe2388f59d7fDd5ab2D2d01', to: '0x8D6e1B63f1f71daD29a324242e9f2d1599aFC174', value: '49' } }, { address: '0x17c4e6453cC49AaAAeaCA894E6D9683e0000023c', event: 'Approval', args: { owner: '0x4880FcB99Ce12Ae0DEe2388f59d7fDd5ab2D2d01', spender: '0x6C9268b814f5Bc855da12a9DDeBF5fFaF2702284', value: '51' } } ]
❌ Fungible: Plain calls
Fungible: Plain calls
❌ Can perform mintBulk()
TypeError: Cannot read properties of undefined (reading 'filter')
❌ Can perform transferFromCross()
AssertionError: expected <Anonymous Class>{ events: undefined } to be like { Transfer: { address: '0x17C4E6453CC49aaAAEAcA894e6d9683e000001e9', event: 'Transfer', returnValues: { from: '0x527F7143d709c7402E9E2bF5502Aaab3373169eF', to: '0x8D323f5393e6A1c0a380F24b32b600B6363A87D4', value: '51' } }, Approval: { address: '0x17C4E6453CC49aaAAEAcA894e6d9683e000001e9', event: 'Approval', returnValues: { owner: '0x527F7143d709c7402E9E2bF5502Aaab3373169eF', spender: '0x853ef55dafd182073f97ab628dB374eC0ADb168f', value: '49' } } }
❌ Fungible: Substrate calls
Fungible: Substrate calls
❌ Events emitted for transferFromCross()
AssertionError: expected <Anonymous Class>{ events: undefined } to be like { Transfer: { address: '0x17C4E6453cc49AaaAeACa894e6D9683E000001f1', event: 'Transfer', returnValues: { from: '0x40F6df05Ea3644CCD1c44f14C7870735ea57A253', to: '0xF3f1c4aD8Cc50D9cF706040ecd7714963Ab4d623', value: '51' } }, Approval: { address: '0x17C4E6453cc49AaaAeACa894e6D9683E000001f1', event: 'Approval', returnValues: { owner: '0x40F6df05Ea3644CCD1c44f14C7870735ea57A253', spender: '0xbC8D21300dC59f44e8F1438f7a62651fB860524f', value: '49' } } }
❌ NFT (Via EVM proxy): Plain calls
NFT (Via EVM proxy): Plain calls
❌ [cross] Can perform mint()
TypeError: result.events.normalized.find is not a function
❌ [eth] Can perform mint()
TypeError: result.events.normalized.find is not a function
❌ Can perform approve()
AssertionError: expected { Approval: { address: '0x17C4E6453cc49aAaaeaCa894E6D9683E00000244', event: 'Approval', returnValues: { owner: '0xD10FD13dD744C258a1F33dfc66Fd26c1f922D66b', approved: '0x3548BdB5E97121F5fD86b55318412262928d1765', tokenId: '1' } } } to deeply equal [ { address: '0x17C4E6453cc49aAaaeaCa894E6D9683E00000244', event: 'Approval', args: { owner: '0xD10FD13dD744C258a1F33dfc66Fd26c1f922D66b', approved: '0x3548BdB5E97121F5fD86b55318412262928d1765', tokenId: '1' } } ]
❌ Can perform burn()
AssertionError: expected { Transfer: { address: '0x17C4e6453CC49AaAaeaca894E6d9683E00000243', event: 'Transfer', returnValues: { from: '0x7F535719471f9f38b1130b9c8E872d00872F9692', to: '0x0000000000000000000000000000000000000000', tokenId: '1' } } } to deeply equal [ { address: '0x17C4e6453CC49AaAaeaca894E6d9683E00000243', event: 'Transfer', args: { from: '0x7F535719471f9f38b1130b9c8E872d00872F9692', to: '0x0000000000000000000000000000000000000000', tokenId: '1' } } ]
❌ Can perform transfer()
AssertionError: expected { Transfer: { address: '0x17C4E6453Cc49AaAAeACA894E6D9683e00000246', event: 'Transfer', returnValues: { from: '0x993943Fe65A003C72722CD61dd6Cf9413c3656Fa', to: '0x63a762Afa11EE07081ADDF551E3a43547aB084E8', tokenId: '1' } } } to deeply equal [ { address: '0x17C4E6453Cc49AaAAeACA894E6D9683e00000246', event: 'Transfer', args: { from: '0x993943Fe65A003C72722CD61dd6Cf9413c3656Fa', to: '0x63a762Afa11EE07081ADDF551E3a43547aB084E8', tokenId: '1' } } ]
❌ Can perform transferFrom()
AssertionError: expected { Transfer: { address: '0x17c4e6453cC49AaaAeACA894E6d9683E00000245', event: 'Transfer', returnValues: { from: '0xc7e4Af11ea80D594A18856DA87F20424aBB176d9', to: '0x19Bf62f30EE189C27Cf9EA460e8296F71039b223', tokenId: '1' } } } to deeply equal [ { address: '0x17c4e6453cC49AaaAeACA894E6d9683E00000245', event: 'Transfer', args: { from: '0xc7e4Af11ea80D594A18856DA87F20424aBB176d9', to: '0x19Bf62f30EE189C27Cf9EA460e8296F71039b223', tokenId: '1' } } ]
❌ Sponsoring EVM contracts
Sponsoring EVM contracts
❌ Self sponsoring can be set by the address that deployed the contract
AssertionError: expected {} to deeply equal [ { address: '0xebE5b67878399e14fbAEe0d1f40d4941D9D03553', event: 'ContractSponsorSet', args: { contractAddress: '0xebE5b67878399e14fbAEe0d1f40d4941D9D03553', sponsor: '0xebE5b67878399e14fbAEe0d1f40d4941D9D03553' } }, { address: '0xebE5b67878399e14fbAEe0d1f40d4941D9D03553', event: 'ContractSponsorshipConfirmed', args: { contractAddress: '0xebE5b67878399e14fbAEe0d1f40d4941D9D03553', sponsor: '0xebE5b67878399e14fbAEe0d1f40d4941D9D03553' } } ]
❌ Sponsor can be removed by the address that deployed the contract
AssertionError: expected {} to deeply equal [ { address: '0x408609E786411E13D1739A93883B812B130D5Fb2', event: 'ContractSponsorRemoved', args: { contractAddress: '0x408609E786411E13D1739A93883B812B130D5Fb2' } } ]
❌ Sponsor can be set by the address that deployed the contract
AssertionError: expected {} to deeply equal [ { address: '0xE80ba4E778cFD65d4363177572bBc9C7229ed20E', event: 'ContractSponsorSet', args: { contractAddress: '0xE80ba4E778cFD65d4363177572bBc9C7229ed20E', sponsor: '0x8ae8EE2ce923b95E70cA599e9CaD5Ab9fFeA23C8' } } ]
❌ Sponsoring is limited, with setContractRateLimit. The limitation is working if transactions are sent more often, the sender pays the commission.
AssertionError: expected 599800222366319762056n to equal 599840439955092984288n
❌ Sponsorship can be confirmed by the address that pending as sponsor
AssertionError: expected {} to deeply equal [ { address: '0x1eefD227228ef51240B2eF55Faa06adE304E3066', event: 'ContractSponsorshipConfirmed', args: { contractAddress: '0x1eefD227228ef51240B2eF55Faa06adE304E3066', sponsor: '0xb5dBcB30Bdd974f3a1c3DeC00C9FE2a5434EbE6C' } } ]
Annotations
Check failure on line 0 in js-packages/tests/mochawesome-report/test-1740389419.json
github-actions / int test results - unique
(!negative tests!) Create NFT collection from EVM ► (!negative tests!) Create NFT collection from EVM ► destroyCollection
Failed test found in:
js-packages/tests/mochawesome-report/test-1740389419.json
Error:
AssertionError: expected { CollectionDestroyed: { address: '0x6C4E9fE1AE37a41E93CEE429e8E1881aBdcbb54F', event: 'CollectionDestroyed', returnValues: { collectionId: '0x17C4e6453cC49AaAaEaca894e6D9683e0000018F' } } } to deeply equal [ { address: '0x6C4E9fE1AE37a41E93CEE429e8E1881aBdcbb54F', event: 'CollectionDestroyed', args: { collectionId: '0x17C4e6453cC49AaAaEaca894e6D9683e0000018F' } } ]
Raw output
AssertionError: expected { CollectionDestroyed: { address: '0x6C4E9fE1AE37a41E93CEE429e8E1881aBdcbb54F', event: 'CollectionDestroyed', returnValues: { collectionId: '0x17C4e6453cC49AaAaEaca894e6D9683e0000018F' } } } to deeply equal [ { address: '0x6C4E9fE1AE37a41E93CEE429e8E1881aBdcbb54F', event: 'CollectionDestroyed', args: { collectionId: '0x17C4e6453cC49AaAaEaca894e6D9683e0000018F' } } ]
at file:///opt/actions-runner/_work/unique-chain/unique-chain/js-packages/tests/eth/createNFTCollection.test.ts:211:53
at process.processTicksAndRejections (node:internal/process/task_queues:95:5)
at async file:///opt/actions-runner/_work/unique-chain/unique-chain/js-packages/test-utils/eth/util.ts:64:13
at async usingEthPlaygrounds (file:///opt/actions-runner/_work/unique-chain/unique-chain/js-packages/test-utils/eth/util.ts:50:9)
at async Context.<anonymous> (file:///opt/actions-runner/_work/unique-chain/unique-chain/js-packages/test-utils/eth/util.ts:60:9)
Check failure on line 0 in js-packages/tests/mochawesome-report/test-1740389419.json
github-actions / int test results - unique
[FT] Sync sub & eth events ► [FT] Sync sub & eth events ► CollectionCreated and CollectionDestroyed events
Failed test found in:
js-packages/tests/mochawesome-report/test-1740389419.json
Error:
AssertionError: expected { CollectionCreated: { address: '0x6C4E9fE1AE37a41E93CEE429e8E1881aBdcbb54F', event: 'CollectionCreated', returnValues: { owner: '0x702668753982F9CF4575A1464Dd3C5Fe3b260484', collectionId: '0x17c4e6453cC49AAaaEacA894e6D9683e000001a0' } } } to contain subset [ { event: 'CollectionCreated', args: { owner: '0x702668753982F9CF4575A1464Dd3C5Fe3b260484', collectionId: '0x17c4e6453cC49AAaaEacA894e6D9683e000001a0' } } ]
Raw output
AssertionError: expected { CollectionCreated: { address: '0x6C4E9fE1AE37a41E93CEE429e8E1881aBdcbb54F', event: 'CollectionCreated', returnValues: { owner: '0x702668753982F9CF4575A1464Dd3C5Fe3b260484', collectionId: '0x17c4e6453cC49AAaaEacA894e6D9683e000001a0' } } } to contain subset [ { event: 'CollectionCreated', args: { owner: '0x702668753982F9CF4575A1464Dd3C5Fe3b260484', collectionId: '0x17c4e6453cC49AAaaEacA894e6D9683e000001a0' } } ]
at testCollectionCreatedAndDestroy (file:///opt/actions-runner/_work/unique-chain/unique-chain/js-packages/tests/eth/events.test.ts:36:30)
at async file:///opt/actions-runner/_work/unique-chain/unique-chain/js-packages/tests/eth/events.test.ts:400:9
at async file:///opt/actions-runner/_work/unique-chain/unique-chain/js-packages/test-utils/eth/util.ts:64:13
at async usingEthPlaygrounds (file:///opt/actions-runner/_work/unique-chain/unique-chain/js-packages/test-utils/eth/util.ts:50:9)
at async Context.<anonymous> (file:///opt/actions-runner/_work/unique-chain/unique-chain/js-packages/test-utils/eth/util.ts:60:9)
Check failure on line 0 in js-packages/tests/mochawesome-report/test-1740389419.json
github-actions / int test results - unique
[NFT] Sync sub & eth events ► [NFT] Sync sub & eth events ► CollectionChanged event for TokenPropertySet, TokenPropertyDeleted
Failed test found in:
js-packages/tests/mochawesome-report/test-1740389419.json
Error:
AssertionError: expected undefined to be like { event: 'TokenChanged', returnValues: { tokenId: '1' } }
Raw output
AssertionError: expected undefined to be like { event: 'TokenChanged', returnValues: { tokenId: '1' } }
at testTokenPropertySetAndDeleted (file:///opt/actions-runner/_work/unique-chain/unique-chain/js-packages/tests/eth/events.test.ts:375:50)
at async file:///opt/actions-runner/_work/unique-chain/unique-chain/js-packages/tests/eth/events.test.ts:454:9
at async file:///opt/actions-runner/_work/unique-chain/unique-chain/js-packages/test-utils/eth/util.ts:64:13
at async usingEthPlaygrounds (file:///opt/actions-runner/_work/unique-chain/unique-chain/js-packages/test-utils/eth/util.ts:50:9)
at async Context.<anonymous> (file:///opt/actions-runner/_work/unique-chain/unique-chain/js-packages/test-utils/eth/util.ts:60:9)
Check failure on line 0 in js-packages/tests/mochawesome-report/test-1740389419.json
github-actions / int test results - unique
[NFT] Sync sub & eth events ► [NFT] Sync sub & eth events ► CollectionCreated and CollectionDestroyed events
Failed test found in:
js-packages/tests/mochawesome-report/test-1740389419.json
Error:
AssertionError: expected { CollectionCreated: { address: '0x6C4E9fE1AE37a41E93CEE429e8E1881aBdcbb54F', event: 'CollectionCreated', returnValues: { owner: '0xBaC96b505a6a712b265D8c4D8b98dcbA29135a01', collectionId: '0x17c4e6453cc49aaaaEaca894e6d9683E000001a8' } } } to contain subset [ { event: 'CollectionCreated', args: { owner: '0xBaC96b505a6a712b265D8c4D8b98dcbA29135a01', collectionId: '0x17c4e6453cc49aaaaEaca894e6d9683E000001a8' } } ]
Raw output
AssertionError: expected { CollectionCreated: { address: '0x6C4E9fE1AE37a41E93CEE429e8E1881aBdcbb54F', event: 'CollectionCreated', returnValues: { owner: '0xBaC96b505a6a712b265D8c4D8b98dcbA29135a01', collectionId: '0x17c4e6453cc49aaaaEaca894e6d9683E000001a8' } } } to contain subset [ { event: 'CollectionCreated', args: { owner: '0xBaC96b505a6a712b265D8c4D8b98dcbA29135a01', collectionId: '0x17c4e6453cc49aaaaEaca894e6d9683E000001a8' } } ]
at testCollectionCreatedAndDestroy (file:///opt/actions-runner/_work/unique-chain/unique-chain/js-packages/tests/eth/events.test.ts:36:30)
at async file:///opt/actions-runner/_work/unique-chain/unique-chain/js-packages/tests/eth/events.test.ts:427:9
at async file:///opt/actions-runner/_work/unique-chain/unique-chain/js-packages/test-utils/eth/util.ts:64:13
at async usingEthPlaygrounds (file:///opt/actions-runner/_work/unique-chain/unique-chain/js-packages/test-utils/eth/util.ts:50:9)
at async Context.<anonymous> (file:///opt/actions-runner/_work/unique-chain/unique-chain/js-packages/test-utils/eth/util.ts:60:9)
Check failure on line 0 in js-packages/tests/mochawesome-report/test-1740389419.json
github-actions / int test results - unique
[RFT] Sync sub & eth events ► [RFT] Sync sub & eth events ► CollectionChanged event for TokenPropertySet, TokenPropertyDeleted
Failed test found in:
js-packages/tests/mochawesome-report/test-1740389419.json
Error:
AssertionError: expected undefined to be like { event: 'TokenChanged', returnValues: { tokenId: '1' } }
Raw output
AssertionError: expected undefined to be like { event: 'TokenChanged', returnValues: { tokenId: '1' } }
at testTokenPropertySetAndDeleted (file:///opt/actions-runner/_work/unique-chain/unique-chain/js-packages/tests/eth/events.test.ts:375:50)
at async file:///opt/actions-runner/_work/unique-chain/unique-chain/js-packages/tests/eth/events.test.ts:493:9
at async file:///opt/actions-runner/_work/unique-chain/unique-chain/js-packages/test-utils/eth/util.ts:64:13
at async usingEthPlaygrounds (file:///opt/actions-runner/_work/unique-chain/unique-chain/js-packages/test-utils/eth/util.ts:50:9)
at async Context.<anonymous> (file:///opt/actions-runner/_work/unique-chain/unique-chain/js-packages/test-utils/eth/util.ts:60:9)
Check failure on line 0 in js-packages/tests/mochawesome-report/test-1740389419.json
github-actions / int test results - unique
[RFT] Sync sub & eth events ► [RFT] Sync sub & eth events ► CollectionCreated and CollectionDestroyed events
Failed test found in:
js-packages/tests/mochawesome-report/test-1740389419.json
Error:
AssertionError: expected { CollectionCreated: { address: '0x6C4E9fE1AE37a41E93CEE429e8E1881aBdcbb54F', event: 'CollectionCreated', returnValues: { owner: '0x63361a30EA4E43788d06f8818BF46Af3F58Ccb29', collectionId: '0x17c4e6453CC49AAAAEAca894E6d9683E000001B2' } } } to contain subset [ { event: 'CollectionCreated', args: { owner: '0x63361a30EA4E43788d06f8818BF46Af3F58Ccb29', collectionId: '0x17c4e6453CC49AAAAEAca894E6d9683E000001B2' } } ]
Raw output
AssertionError: expected { CollectionCreated: { address: '0x6C4E9fE1AE37a41E93CEE429e8E1881aBdcbb54F', event: 'CollectionCreated', returnValues: { owner: '0x63361a30EA4E43788d06f8818BF46Af3F58Ccb29', collectionId: '0x17c4e6453CC49AAAAEAca894E6d9683E000001B2' } } } to contain subset [ { event: 'CollectionCreated', args: { owner: '0x63361a30EA4E43788d06f8818BF46Af3F58Ccb29', collectionId: '0x17c4e6453CC49AAAAEAca894E6d9683E000001B2' } } ]
at testCollectionCreatedAndDestroy (file:///opt/actions-runner/_work/unique-chain/unique-chain/js-packages/tests/eth/events.test.ts:36:30)
at async file:///opt/actions-runner/_work/unique-chain/unique-chain/js-packages/tests/eth/events.test.ts:466:9
at async file:///opt/actions-runner/_work/unique-chain/unique-chain/js-packages/test-utils/eth/util.ts:64:13
at async usingEthPlaygrounds (file:///opt/actions-runner/_work/unique-chain/unique-chain/js-packages/test-utils/eth/util.ts:50:9)
at async Context.<anonymous> (file:///opt/actions-runner/_work/unique-chain/unique-chain/js-packages/test-utils/eth/util.ts:60:9)
Check failure on line 0 in js-packages/tests/mochawesome-report/test-1740389419.json
github-actions / int test results - unique
Create collection from EVM ► Create collection from EVM Fungible collection ► destroyCollection
Failed test found in:
js-packages/tests/mochawesome-report/test-1740389419.json
Error:
AssertionError: expected { CollectionDestroyed: { address: '0x6C4E9fE1AE37a41E93CEE429e8E1881aBdcbb54F', event: 'CollectionDestroyed', returnValues: { collectionId: '0x17C4E6453cc49aAAaeaca894E6D9683e00000145' } } } to deeply equal [ { address: '0x6C4E9fE1AE37a41E93CEE429e8E1881aBdcbb54F', event: 'CollectionDestroyed', args: { collectionId: '0x17C4E6453cc49aAAaeaca894E6D9683e00000145' } } ]
Raw output
AssertionError: expected { CollectionDestroyed: { address: '0x6C4E9fE1AE37a41E93CEE429e8E1881aBdcbb54F', event: 'CollectionDestroyed', returnValues: { collectionId: '0x17C4E6453cc49aAAaeaca894E6D9683e00000145' } } } to deeply equal [ { address: '0x6C4E9fE1AE37a41E93CEE429e8E1881aBdcbb54F', event: 'CollectionDestroyed', args: { collectionId: '0x17C4E6453cc49aAAaeaca894E6D9683e00000145' } } ]
at file:///opt/actions-runner/_work/unique-chain/unique-chain/js-packages/tests/eth/createCollection.test.ts:65:57
at process.processTicksAndRejections (node:internal/process/task_queues:95:5)
at async file:///opt/actions-runner/_work/unique-chain/unique-chain/js-packages/test-utils/eth/util.ts:64:13
at async usingEthPlaygrounds (file:///opt/actions-runner/_work/unique-chain/unique-chain/js-packages/test-utils/eth/util.ts:50:9)
at async Context.<anonymous> (file:///opt/actions-runner/_work/unique-chain/unique-chain/js-packages/test-utils/eth/util.ts:60:9)
Check failure on line 0 in js-packages/tests/mochawesome-report/test-1740389419.json
github-actions / int test results - unique
Create collection from EVM ► Create collection from EVM Nonfungible collection ► Create collection
Failed test found in:
js-packages/tests/mochawesome-report/test-1740389419.json
Error:
AssertionError: expected { CollectionCreated: { address: '0x6C4E9fE1AE37a41E93CEE429e8E1881aBdcbb54F', event: 'CollectionCreated', returnValues: { owner: '0x1bacF0948a0047f19D7e492F5c4A375FDB1fCd47', collectionId: '0x17C4E6453cc49AAAaEAcA894E6d9683E00000146' } } } to deeply equal [ { address: '0x6C4E9fE1AE37a41E93CEE429e8E1881aBdcbb54F', event: 'CollectionCreated', args: { owner: '0x1bacF0948a0047f19D7e492F5c4A375FDB1fCd47', collectionId: '0x17C4E6453cc49AAAaEAcA894E6d9683E00000146' } } ]
Raw output
AssertionError: expected { CollectionCreated: { address: '0x6C4E9fE1AE37a41E93CEE429e8E1881aBdcbb54F', event: 'CollectionCreated', returnValues: { owner: '0x1bacF0948a0047f19D7e492F5c4A375FDB1fCd47', collectionId: '0x17C4E6453cc49AAAaEAcA894E6d9683E00000146' } } } to deeply equal [ { address: '0x6C4E9fE1AE37a41E93CEE429e8E1881aBdcbb54F', event: 'CollectionCreated', args: { owner: '0x1bacF0948a0047f19D7e492F5c4A375FDB1fCd47', collectionId: '0x17C4E6453cc49AAAaEAcA894E6d9683E00000146' } } ]
at file:///opt/actions-runner/_work/unique-chain/unique-chain/js-packages/tests/eth/createCollection.test.ts:164:39
at process.processTicksAndRejections (node:internal/process/task_queues:95:5)
at async file:///opt/actions-runner/_work/unique-chain/unique-chain/js-packages/test-utils/eth/util.ts:64:13
at async usingEthPlaygrounds (file:///opt/actions-runner/_work/unique-chain/unique-chain/js-packages/test-utils/eth/util.ts:50:9)
at async Context.<anonymous> (file:///opt/actions-runner/_work/unique-chain/unique-chain/js-packages/test-utils/eth/util.ts:60:9)
Check failure on line 0 in js-packages/tests/mochawesome-report/test-1740389419.json
github-actions / int test results - unique
Create collection from EVM ► Create collection from EVM Sponsoring ► Can sponsor from evm address via access list
Failed test found in:
js-packages/tests/mochawesome-report/test-1740389419.json
Error:
TypeError: result.events.normalized.find is not a function
Raw output
TypeError: result.events.normalized.find is not a function
at file:///opt/actions-runner/_work/unique-chain/unique-chain/js-packages/tests/eth/createCollection.test.ts:438:22
at process.processTicksAndRejections (node:internal/process/task_queues:95:5)
at async file:///opt/actions-runner/_work/unique-chain/unique-chain/js-packages/test-utils/eth/util.ts:64:13
at async usingEthPlaygrounds (file:///opt/actions-runner/_work/unique-chain/unique-chain/js-packages/test-utils/eth/util.ts:50:9)
at async Context.<anonymous> (file:///opt/actions-runner/_work/unique-chain/unique-chain/js-packages/test-utils/eth/util.ts:60:9)
Check failure on line 0 in js-packages/tests/mochawesome-report/test-1740389419.json
github-actions / int test results - unique
Create collection from EVM ► Create collection from EVM Sponsoring ► Check that transaction via EVM spend money from sponsor address
Failed test found in:
js-packages/tests/mochawesome-report/test-1740389419.json
Error:
TypeError: mintingResult.events.normalized.find is not a function
Raw output
TypeError: mintingResult.events.normalized.find is not a function
at file:///opt/actions-runner/_work/unique-chain/unique-chain/js-packages/tests/eth/createCollection.test.ts:493:18
at process.processTicksAndRejections (node:internal/process/task_queues:95:5)
at async file:///opt/actions-runner/_work/unique-chain/unique-chain/js-packages/test-utils/eth/util.ts:64:13
at async usingEthPlaygrounds (file:///opt/actions-runner/_work/unique-chain/unique-chain/js-packages/test-utils/eth/util.ts:50:9)
at async Context.<anonymous> (file:///opt/actions-runner/_work/unique-chain/unique-chain/js-packages/test-utils/eth/util.ts:60:9)
Check failure on line 0 in js-packages/tests/mochawesome-report/test-1740389419.json
github-actions / int test results - unique
Create FT collection from EVM ► Create FT collection from EVM ► destroyCollection
Failed test found in:
js-packages/tests/mochawesome-report/test-1740389419.json
Error:
AssertionError: expected { CollectionDestroyed: { address: '0x6C4E9fE1AE37a41E93CEE429e8E1881aBdcbb54F', event: 'CollectionDestroyed', returnValues: { collectionId: '0x17c4e6453cc49AaAAEAca894E6d9683E00000184' } } } to deeply equal [ { address: '0x6C4E9fE1AE37a41E93CEE429e8E1881aBdcbb54F', event: 'CollectionDestroyed', args: { collectionId: '0x17c4e6453cc49AaAAEAca894E6d9683E00000184' } } ]
Raw output
AssertionError: expected { CollectionDestroyed: { address: '0x6C4E9fE1AE37a41E93CEE429e8E1881aBdcbb54F', event: 'CollectionDestroyed', returnValues: { collectionId: '0x17c4e6453cc49AaAAEAca894E6d9683E00000184' } } } to deeply equal [ { address: '0x6C4E9fE1AE37a41E93CEE429e8E1881aBdcbb54F', event: 'CollectionDestroyed', args: { collectionId: '0x17c4e6453cc49AaAAEAca894E6d9683E00000184' } } ]
at file:///opt/actions-runner/_work/unique-chain/unique-chain/js-packages/tests/eth/createFTCollection.test.ts:74:53
at process.processTicksAndRejections (node:internal/process/task_queues:95:5)
at async file:///opt/actions-runner/_work/unique-chain/unique-chain/js-packages/test-utils/eth/util.ts:64:13
at async usingEthPlaygrounds (file:///opt/actions-runner/_work/unique-chain/unique-chain/js-packages/test-utils/eth/util.ts:50:9)
at async Context.<anonymous> (file:///opt/actions-runner/_work/unique-chain/unique-chain/js-packages/test-utils/eth/util.ts:60:9)